BDBM11590 1c-meta-CF3::5-(aminomethyl)-6-(2,4-dichlorophenyl)-2-[3-(trifluoromethyl)phenyl]pyrimidin-4-amine::Aminomethylpyrimidine 1cl
SMILES: NCc1c(N)nc(nc1-c1ccc(Cl)cc1Cl)-c1cccc(c1)C(F)(F)F
InChI Key: InChIKey=HCOLDJWQZBLQES-UHFFFAOYSA-N
Data: 1 IC50
Activity Spreadsheet -- Enzyme Inhibition Constant Data from BindingDB
Found 1 hit for monomerid = 11590
Trg + Lig
Ki
nM
ΔG°
kcal/mole
IC50
nM
Kd
nM
EC50/IC50
nM
koff
s-1
kon
M-1s-1
pHTemp
°C
Dipeptidyl peptidase 4
(Homo sapiens (Human))
BDBM11590
(1c-meta-CF3 | 5-(aminomethyl)-6-(2,4-dichloropheny...)
Show SMILES NCc1c(N)nc(nc1-c1ccc(Cl)cc1Cl)-c1cccc(c1)C(F)(F)F
Show InChI InChI=1S/C18H13Cl2F3N4/c19-11-4-5-12(14(20)7-11)15-13(8-24)16(25)27-17(26-15)9-2-1-3-10(6-9)18(21,22)23/h1-7H,8,24H2,(H2,25,26,27)
Reactome pathway
n/an/a 130n/an/an/an/an/an/a
Hoffmann-La Roche Inc.
Assay Description
DPP-IV inhibitors were measured for their ability to inhibit DPP-IV mediated cleavage of Ala-Pro-7-amido-4-trifluoromethylcoumarin in a fluorogenic a...
Bioorg Med Chem Lett 14: 1491-3 (2004)
Article DOI: 10.1016/j.bmcl.2004.01.019
BindingDB Entry DOI: 10.7270/Q22B8W7M