BDBM116928 US8637532, 655
SMILES: CCOc1ccc(cc1)C(=O)Nc1cccc(CNc2ncnc3c(cccc23)C(N)=O)c1
InChI Key: InChIKey=ZIAKJYHNHPITCS-UHFFFAOYSA-N
Data: 2 IC50
Activity Spreadsheet -- Enzyme Inhibition Constant Data from BindingDB
Found 2 hits for monomerid = 116928
Trg + Lig
Ki
nM
ΔG°
kcal/mole
IC50
nM
Kd
nM
EC50/IC50
nM
koff
s-1
kon
M-1s-1
pHTemp
°C
Aurora kinase B
(Homo sapiens (Human))
BDBM116928
(US8637532, 655)
Show SMILES CCOc1ccc(cc1)C(=O)Nc1cccc(CNc2ncnc3c(cccc23)C(N)=O)c1
Show InChI InChI=1S/C25H23N5O3/c1-2-33-19-11-9-17(10-12-19)25(32)30-18-6-3-5-16(13-18)14-27-24-21-8-4-7-20(23(26)31)22(21)28-15-29-24/h3-13,15H,2,14H2,1H3,(H2,26,31)(H,30,32)(H,27,28,29)
Reactome pathway
US Patent
n/an/a 1.80n/an/an/an/an/an/a
Merck Patent GmbH
US Patent
Assay Description
The Aurora assays described here are performed on two Caliper Life Sciences systems: the LC3000 and the Desktop Profiler. These provide data on enzym...
US Patent US8637532 (2014)
BindingDB Entry DOI: 10.7270/Q21G0JZX
Aurora kinase A
(Homo sapiens (Human))
BDBM116928
(US8637532, 655)
Show SMILES CCOc1ccc(cc1)C(=O)Nc1cccc(CNc2ncnc3c(cccc23)C(N)=O)c1
Show InChI InChI=1S/C25H23N5O3/c1-2-33-19-11-9-17(10-12-19)25(32)30-18-6-3-5-16(13-18)14-27-24-21-8-4-7-20(23(26)31)22(21)28-15-29-24/h3-13,15H,2,14H2,1H3,(H2,26,31)(H,30,32)(H,27,28,29)
NCI pathway
Reactome pathway
US Patent
n/an/a 0.130n/an/an/an/an/an/a
Merck Patent GmbH
US Patent
Assay Description
The Aurora assays described here are performed on two Caliper Life Sciences systems: the LC3000 and the Desktop Profiler. These provide data on enzym...
US Patent US8637532 (2014)
BindingDB Entry DOI: 10.7270/Q21G0JZX