BDBM1172 N-[3-[Cyclopropyl(4-hydroxy-2-oxo-6-propyl-2H-pyran-3-yl)methyl]phenyl]-1-methyl-1H-imidazole-4-sulfonamide::N-{3-[cyclopropyl(4-hydroxy-2-oxo-6-propyl-2H-pyran-3-yl)methyl]phenyl}-1-methyl-1H-imidazole-4-sulfonamide::Sulfonamide-Containing 4-Hydroxy-2-pyrone deriv. XII
SMILES: CCCc1cc(O)c(C(C2CC2)c2cccc(NS(=O)(=O)c3cn(C)cn3)c2)c(=O)o1
InChI Key: InChIKey=AHSQZQWEKNDRIX-UHFFFAOYSA-N
Data: 1 KI
Activity Spreadsheet -- Enzyme Inhibition Constant Data from BindingDB
Found 1 hit for monomerid = 1172
Trg + Lig
Ki
nM
ΔG°
kcal/mole
IC50
nM
Kd
nM
EC50/IC50
nM
koff
s-1
kon
M-1s-1
pHTemp
°C
HIV-1 Protease
(Human immunodeficiency virus type 1)
BDBM1172
(N-[3-[Cyclopropyl(4-hydroxy-2-oxo-6-propyl-2H-pyra...)
Show SMILES CCCc1cc(O)c(C(C2CC2)c2cccc(NS(=O)(=O)c3cn(C)cn3)c2)c(=O)o1
Show InChI InChI=1S/C22H25N3O5S/c1-3-5-17-11-18(26)21(22(27)30-17)20(14-8-9-14)15-6-4-7-16(10-15)24-31(28,29)19-12-25(2)13-23-19/h4,6-7,10-14,20,24,26H,3,5,8-9H2,1-2H3
1.40 -11.9n/an/an/an/an/a5.022
Upjohn
Assay Description
HIV-1 protease was purified and refolded from E. coli inclusion bodies. The substrate used spans the p17-p24 processing site (R-V-S-Q-N-Y-P-I-V-Q-N-K...
J Med Chem 39: 2400-10 (1996)
Article DOI: 10.1021/jm950888f
BindingDB Entry DOI: 10.7270/Q20K26RK