BDBM118208 US8673966, N-(4-(4-oxo-7-((2-oxo-1,2-dihydropyridin-4- yl)ethynyl)-4H-chromen-3-yl)phenyl)methanesulfonamide
SMILES: CS(=O)(=O)Nc1ccc(cc1)-c1coc2cc(ccc2c1=O)C#Cc1cc[nH]c(=O)c1
InChI Key: InChIKey=SDXFGKHDKBQKRY-UHFFFAOYSA-N
Data: 3 IC50
Activity Spreadsheet -- Enzyme Inhibition Constant Data from BindingDB
Found 3 hits for monomerid = 118208
Trg + Lig
Ki
nM
ΔG°
kcal/mole
IC50
nM
Kd
nM
EC50/IC50
nM
koff
s-1
kon
M-1s-1
pHTemp
°C
Aldehyde dehydrogenase, mitochondrial
(Homo sapiens (Human))
BDBM118208
(US8673966, N-(4-(4-oxo-7-((2-oxo-1,2-dihydropyridi...)
Show SMILES CS(=O)(=O)Nc1ccc(cc1)-c1coc2cc(ccc2c1=O)C#Cc1cc[nH]c(=O)c1
Show InChI InChI=1S/C23H16N2O5S/c1-31(28,29)25-18-7-5-17(6-8-18)20-14-30-21-12-15(4-9-19(21)23(20)27)2-3-16-10-11-24-22(26)13-16/h4-14,25H,1H3,(H,24,26)
Reactome pathway
US Patent
n/an/a 9n/an/an/an/a7.4n/a
Gilead Sciences, Inc.
US Patent
Assay Description
Standard ALDH2 reaction mixtures contained 150 uM formaldehyde, 2.5 mM NAD+, 10 mM MgCl2 and 10 nM recombinant human ALDH2 in 50 mM Hepes buffer, pH ...
US Patent US8673966 (2014)
BindingDB Entry DOI: 10.7270/Q2QZ28MX
Amine oxidase [flavin-containing] B
(Homo sapiens (Human))
BDBM118208
(US8673966, N-(4-(4-oxo-7-((2-oxo-1,2-dihydropyridi...)
Show SMILES CS(=O)(=O)Nc1ccc(cc1)-c1coc2cc(ccc2c1=O)C#Cc1cc[nH]c(=O)c1
Show InChI InChI=1S/C23H16N2O5S/c1-31(28,29)25-18-7-5-17(6-8-18)20-14-30-21-12-15(4-9-19(21)23(20)27)2-3-16-10-11-24-22(26)13-16/h4-14,25H,1H3,(H,24,26)
US Patent
n/an/a>1.30E+5n/an/an/an/a7.5n/a
Gilead Sciences, Inc.
US Patent
Assay Description
MAO assays included luminogenic MAO substrate, reaction buffers, Luciferin Detection and the reconstitution buffer with esterase. Standard MAO reacti...
US Patent US8673966 (2014)
BindingDB Entry DOI: 10.7270/Q2QZ28MX
Amine oxidase (flavin-containing) A
(Homo sapiens (Human))
BDBM118208
(US8673966, N-(4-(4-oxo-7-((2-oxo-1,2-dihydropyridi...)
Show SMILES CS(=O)(=O)Nc1ccc(cc1)-c1coc2cc(ccc2c1=O)C#Cc1cc[nH]c(=O)c1
Show InChI InChI=1S/C23H16N2O5S/c1-31(28,29)25-18-7-5-17(6-8-18)20-14-30-21-12-15(4-9-19(21)23(20)27)2-3-16-10-11-24-22(26)13-16/h4-14,25H,1H3,(H,24,26)
US Patent
n/an/a>1.30E+5n/an/an/an/a7.5n/a
Gilead Sciences, Inc.
US Patent
Assay Description
MAO assays included luminogenic MAO substrate, reaction buffers, Luciferin Detection and the reconstitution buffer with esterase. Standard MAO reacti...
US Patent US8673966 (2014)
BindingDB Entry DOI: 10.7270/Q2QZ28MX