BDBM11828 US8846929, 101
SMILES: [H][C@]12CC[C@]([H])(C[C@@]([H])(C1)n1c3ccccc3nc(N3CC[C@@H](N)C3)c1=O)N2C1CCCCCCC1
InChI Key: InChIKey=SMXDKYPJJWXFLI-LGKPFJOYSA-N
Data: 4 KI
Activity Spreadsheet -- Enzyme Inhibition Constant Data from BindingDB
Found 4 hits for monomerid = 11828
Trg + Lig
Ki
nM
ΔG°
kcal/mole
IC50
nM
Kd
nM
EC50/IC50
nM
koff
s-1
kon
M-1s-1
pHTemp
°C
Opioid growth factor receptor-like protein 1
(Homo sapiens (Human))
BDBM11828
(US8846929, 101)
Show SMILES [H][C@]12CC[C@]([H])(C[C@@]([H])(C1)n1c3ccccc3nc(N3CC[C@@H](N)C3)c1=O)N2C1CCCCCCC1 |r,TLB:10:7:27:2.3|
Show InChI InChI=1S/C27H39N5O/c28-19-14-15-30(18-19)26-27(33)32(25-11-7-6-10-24(25)29-26)23-16-21-12-13-22(17-23)31(21)20-8-4-2-1-3-5-9-20/h6-7,10-11,19-23H,1-5,8-9,12-18,28H2/t19-,21-,22+,23+/m1/s1
US Patent
1.60n/an/an/an/an/an/a7.4n/a
Purdue Pharma L.P.; Shionogi & Co., Ltd.
US Patent
Assay Description
Radioligand binding assays (screening and dose-displacement) used 0.1nM [3H]-nociceptin (NEN; 87.7 Cl/nimole) with 10-20 ug membrane protein in a fin...
US Patent US8846929 (2014)
BindingDB Entry DOI: 10.7270/Q2G44P04
Kappa-type opioid receptor
(Homo sapiens (Human))
BDBM11828
(US8846929, 101)
Show SMILES [H][C@]12CC[C@]([H])(C[C@@]([H])(C1)n1c3ccccc3nc(N3CC[C@@H](N)C3)c1=O)N2C1CCCCCCC1 |r,TLB:10:7:27:2.3|
Show InChI InChI=1S/C27H39N5O/c28-19-14-15-30(18-19)26-27(33)32(25-11-7-6-10-24(25)29-26)23-16-21-12-13-22(17-23)31(21)20-8-4-2-1-3-5-9-20/h6-7,10-11,19-23H,1-5,8-9,12-18,28H2/t19-,21-,22+,23+/m1/s1
Reactome pathway
US Patent
14.9n/an/an/an/an/an/a7.4n/a
Purdue Pharma L.P.; Shionogi & Co., Ltd.
US Patent
Assay Description
Radioligand dose displacement assays used 0.4-0.8nM [3H]-U69,593 (NEN; 40 Ci/mmole) with 10-20 ug membrane protein (recombinant kappa opioid receptor...
US Patent US8846929 (2014)
BindingDB Entry DOI: 10.7270/Q2G44P04
Mu-type opioid receptor
(Homo sapiens (Human))
BDBM11828
(US8846929, 101)
Show SMILES [H][C@]12CC[C@]([H])(C[C@@]([H])(C1)n1c3ccccc3nc(N3CC[C@@H](N)C3)c1=O)N2C1CCCCCCC1 |r,TLB:10:7:27:2.3|
Show InChI InChI=1S/C27H39N5O/c28-19-14-15-30(18-19)26-27(33)32(25-11-7-6-10-24(25)29-26)23-16-21-12-13-22(17-23)31(21)20-8-4-2-1-3-5-9-20/h6-7,10-11,19-23H,1-5,8-9,12-18,28H2/t19-,21-,22+,23+/m1/s1
NCI pathway
Reactome pathway
US Patent
590n/an/an/an/an/an/a7.4n/a
Purdue Pharma L.P.; Shionogi & Co., Ltd.
US Patent
Assay Description
Radioligand dose-displacement binding assays for u-opioid receptors used 0.2nM[3H]-diprenorphine (NEN, Boston, Mass.), with 5-20mg membrane protein/w...
US Patent US8846929 (2014)
BindingDB Entry DOI: 10.7270/Q2G44P04
Delta-type opioid receptor
(Homo sapiens (Human))
BDBM11828
(US8846929, 101)
Show SMILES [H][C@]12CC[C@]([H])(C[C@@]([H])(C1)n1c3ccccc3nc(N3CC[C@@H](N)C3)c1=O)N2C1CCCCCCC1 |r,TLB:10:7:27:2.3|
Show InChI InChI=1S/C27H39N5O/c28-19-14-15-30(18-19)26-27(33)32(25-11-7-6-10-24(25)29-26)23-16-21-12-13-22(17-23)31(21)20-8-4-2-1-3-5-9-20/h6-7,10-11,19-23H,1-5,8-9,12-18,28H2/t19-,21-,22+,23+/m1/s1
Reactome pathway
US Patent
1.40E+4n/an/an/an/an/an/a7.4n/a
Purdue Pharma L.P.; Shionogi & Co., Ltd.
US Patent
Assay Description
Radioligand dose-displacement assays used 0.2nM [3H]-Naltrindole (NEN; 33.0 Ci/mmole) with 10-20ug membrane protein (recombinant delta opioid recepto...
US Patent US8846929 (2014)
BindingDB Entry DOI: 10.7270/Q2G44P04