BDBM119075 Terreic acid (12)
SMILES: Cc1c(O)c2Oc2c(O)c1O
InChI Key: InChIKey=KDDDKUDGIQOQGM-UHFFFAOYSA-N
Data: 1 IC50
Activity Spreadsheet -- Enzyme Inhibition Constant Data from BindingDB
Found 1 hit for monomerid = 119075
Trg + Lig
Ki
nM
ΔG°
kcal/mole
IC50
nM
Kd
nM
EC50/IC50
nM
koff
s-1
kon
M-1s-1
pHTemp
°C
MurA (E. cloacae)
(Enterobacter cloacae (Enterobacteria))
BDBM119075
(Terreic acid (12))
Show SMILES Cc1c(O)c2Oc2c(O)c1O
Show InChI InChI=1S/C7H6O4/c1-2-3(8)5(10)7-6(11-7)4(2)9/h8-10H,1H3
n/an/a 1.40E+4n/an/an/an/an/an/a
University of Ljubljana, A?kerceva 7, 1000 Ljubljana, Slovenia
Bioorg Chem 55: 2-15 (2014)
Article DOI: 10.1016/j.bioorg.2014.03.008
BindingDB Entry DOI: 10.7270/Q2ZG6QWR