BDBM119120 MurF inhibitor (compound 62)
SMILES: COc1ccc(cc1OC)C(NC(=O)c1ccccc1)c1ccc2cccnc2c1O
InChI Key: InChIKey=SODCIWIGEOKFSE-UHFFFAOYSA-N
Data: 1 IC50
Activity Spreadsheet -- Enzyme Inhibition Constant Data from BindingDB
Found 1 hit for monomerid = 119120
Trg + Lig
Ki
nM
ΔG°
kcal/mole
IC50
nM
Kd
nM
EC50/IC50
nM
koff
s-1
kon
M-1s-1
pHTemp
°C
UDP-N-acetylmuramoyl-tripeptide--D-alanyl-D-alanine ligase
(Escherichia coli)
BDBM119120
(MurF inhibitor (compound 62))
Show SMILES COc1ccc(cc1OC)C(NC(=O)c1ccccc1)c1ccc2cccnc2c1O
Show InChI InChI=1S/C25H22N2O4/c1-30-20-13-11-18(15-21(20)31-2)22(27-25(29)17-7-4-3-5-8-17)19-12-10-16-9-6-14-26-23(16)24(19)28/h3-15,22,28H,1-2H3,(H,27,29)
n/an/a 1.60E+4n/an/an/an/an/an/a
University of Ljubljana, A?kerceva 7, 1000 Ljubljana, Slovenia
Bioorg Chem 55: 2-15 (2014)
Article DOI: 10.1016/j.bioorg.2014.03.008
BindingDB Entry DOI: 10.7270/Q2ZG6QWR