BDBM119410 US8669252, 27
SMILES: Clc1ccc(cc1)C(NC(=O)[C@@H]1CC[C@H](C[C@H]1c1ccc(Br)cc1)N1CCOCC1)c1ccc(cc1)C#N
InChI Key: InChIKey=LAAMLAXDYTXZKI-LEFASQKVSA-N
Data: 1 IC50
Activity Spreadsheet -- Enzyme Inhibition Constant Data from BindingDB
Found 1 hit for monomerid = 119410
Trg + Lig
Ki
nM
ΔG°
kcal/mole
IC50
nM
Kd
nM
EC50/IC50
nM
koff
s-1
kon
M-1s-1
pHTemp
°C
Prolylcarboxypeptidase (PRCP)
(Homo sapiens (Human))
BDBM119410
(US8669252, 27)
Show SMILES Clc1ccc(cc1)C(NC(=O)[C@@H]1CC[C@H](C[C@H]1c1ccc(Br)cc1)N1CCOCC1)c1ccc(cc1)C#N |r|
Show InChI InChI=1S/C31H31BrClN3O2/c32-25-9-5-22(6-10-25)29-19-27(36-15-17-38-18-16-36)13-14-28(29)31(37)35-30(24-7-11-26(33)12-8-24)23-3-1-21(20-34)2-4-23/h1-12,27-30H,13-19H2,(H,35,37)/t27-,28-,29+,30?/m1/s1
Reactome pathway
US Patent
n/an/a 5.40n/an/an/an/an/an/a
Merck Sharp & Dohme Corp.
US Patent
Assay Description
The potency of compounds of formula I against PrCP was determined by a fluorescence intensity kinetic assay measuring the IC50 values of PrCP inhibit...
US Patent US8669252 (2014)
BindingDB Entry DOI: 10.7270/Q2J9652X