BDBM119412 US8669252, 50
SMILES: Fc1ccc(cc1)C(NC(=O)[C@@H]1CC[C@H](C[C@H]1c1ccccc1F)N1CCOCC1)c1ccc(F)cc1
InChI Key: InChIKey=PLVLBDZMRYQTDG-IEUSDUHPSA-N
Data: 1 IC50
Activity Spreadsheet -- Enzyme Inhibition Constant Data from BindingDB
Found 1 hit for monomerid = 119412
Trg + Lig
Ki
nM
ΔG°
kcal/mole
IC50
nM
Kd
nM
EC50/IC50
nM
koff
s-1
kon
M-1s-1
pHTemp
°C
Prolylcarboxypeptidase (PRCP)
(Homo sapiens (Human))
BDBM119412
(US8669252, 50)
Show SMILES Fc1ccc(cc1)C(NC(=O)[C@@H]1CC[C@H](C[C@H]1c1ccccc1F)N1CCOCC1)c1ccc(F)cc1 |r|
Show InChI InChI=1S/C30H31F3N2O2/c31-22-9-5-20(6-10-22)29(21-7-11-23(32)12-8-21)34-30(36)26-14-13-24(35-15-17-37-18-16-35)19-27(26)25-3-1-2-4-28(25)33/h1-12,24,26-27,29H,13-19H2,(H,34,36)/t24-,26-,27+/m1/s1
Reactome pathway
US Patent
n/an/a 1.70n/an/an/an/an/an/a
Merck Sharp & Dohme Corp.
US Patent
Assay Description
The potency of compounds of formula I against PrCP was determined by a fluorescence intensity kinetic assay measuring the IC50 values of PrCP inhibit...
US Patent US8669252 (2014)
BindingDB Entry DOI: 10.7270/Q2J9652X