null
SMILES: N[C@H]1CCc2nc(NC(=O)c3cccc(CNC(=O)c4cccc(c4)-c4cn[nH]c4)c3)sc2C1
InChI Key: InChIKey=NMMAOBDSOJXRMN-FQEVSTJZSA-N
Activity Spreadsheet -- Enzyme Inhibition Constant Data from BindingDB
Found 2 hits for monomerid = 119907
Trg + Lig
Ki
nM
ΔG°
kcal/mole
IC50
nM
Kd
nM
EC50/IC50
nM
koff
s-1
kon
M-1s-1
pHTemp
°C
Rho-associated protein kinase 2
(Homo sapiens (Human))
BDBM119907
(US8697911, 30)
Show SMILES N[C@H]1CCc2nc(NC(=O)c3cccc(CNC(=O)c4cccc(c4)-c4cn[nH]c4)c3)sc2C1 |r|
Show InChI InChI=1S/C25H24N6O2S/c26-20-7-8-21-22(11-20)34-25(30-21)31-24(33)17-5-1-3-15(9-17)12-27-23(32)18-6-2-4-16(10-18)19-13-28-29-14-19/h1-6,9-10,13-14,20H,7-8,11-12,26H2,(H,27,32)(H,28,29)(H,30,31,33)/t20-/m0/s1
US Patent
n/an/a 0.160n/an/an/an/a7.2n/a
Boehringer Ingelheim International GmbH
US Patent
Assay Description
This assay is performed using FAM S6 substrate peptide (Catalogue #R7184) and IMAP FP Screening Express Kit detection reagents from Molecular Devices...
US Patent US8697911 (2014)
BindingDB Entry DOI: 10.7270/Q25X27KR
Rho-associated protein kinase 2
(Homo sapiens (Human))
BDBM119907
(US8697911, 30)
Show SMILES N[C@H]1CCc2nc(NC(=O)c3cccc(CNC(=O)c4cccc(c4)-c4cn[nH]c4)c3)sc2C1 |r|
Show InChI InChI=1S/C25H24N6O2S/c26-20-7-8-21-22(11-20)34-25(30-21)31-24(33)17-5-1-3-15(9-17)12-27-23(32)18-6-2-4-16(10-18)19-13-28-29-14-19/h1-6,9-10,13-14,20H,7-8,11-12,26H2,(H,27,32)(H,28,29)(H,30,31,33)/t20-/m0/s1
US Patent
n/an/a 0.720n/an/an/an/a7.528
Boehringer Ingelheim International GmbH
US Patent
Assay Description
The activity of ROCKII (1-543) kinase is measured utilizing Cambrex PKLight ATP Detection Reagent, a homogeneous assay technology using luciferin-luc...
US Patent US8697911 (2014)
BindingDB Entry DOI: 10.7270/Q25X27KR