BDBM12053 (3S)-3-{[2-(naphthalen-1-yl)benzene]sulfonamido}-4-oxobutanoic acid::(S)-3-(2-Naphthalen-1-yl-benzenesulfonylamino)-4-oxo-butyric acid::arylsulfonamide analogue 17
SMILES: OC(=O)C[C@H](NS(=O)(=O)c1ccccc1-c1cccc2ccccc12)C=O
InChI Key: InChIKey=GWNHGXUAHVPJPQ-HNNXBMFYSA-N
Data: 1 KI
Activity Spreadsheet -- Enzyme Inhibition Constant Data from BindingDB
Found 1 hit for monomerid = 12053
Trg + Lig
Ki
nM
ΔG°
kcal/mole
IC50
nM
Kd
nM
EC50/IC50
nM
koff
s-1
kon
M-1s-1
pHTemp
°C
Caspase-1
(Homo sapiens (Human))
BDBM12053
((3S)-3-{[2-(naphthalen-1-yl)benzene]sulfonamido}-4...)
Show SMILES OC(=O)C[C@H](NS(=O)(=O)c1ccccc1-c1cccc2ccccc12)C=O |r|
Show InChI InChI=1S/C20H17NO5S/c22-13-15(12-20(23)24)21-27(25,26)19-11-4-3-9-18(19)17-10-5-7-14-6-1-2-8-16(14)17/h1-11,13,15,21H,12H2,(H,23,24)/t15-/m0/s1
NCI pathway
Reactome pathway
6.90E+3 -7.32n/an/an/an/an/a7.037
Pfizer
Assay Description
The substrate peptides terminating in AMC are processed by caspases with or without inhibitors, and the accumulation of AMC was assessed with a Cytof...
Bioorg Med Chem 10: 31-40 (2002)
Article DOI: 10.1016/s0968-0896(01)00250-4
BindingDB Entry DOI: 10.7270/Q2BP011G