BDBM12071 4-[4-(2-{[(2S)-1-carboxy-3-oxopropan-2-yl]sulfamoyl}phenoxy)phenyl]benzoic acid::Diphenyl Ether Sulfonamide 17
SMILES: OC(=O)C[C@H](NS(=O)(=O)c1ccccc1Oc1ccc(cc1)-c1ccc(cc1)C(O)=O)C=O
InChI Key: InChIKey=AEQISBSPFSQKKJ-SFHVURJKSA-N
Data: 1 KI
Activity Spreadsheet -- Enzyme Inhibition Constant Data from BindingDB
Found 1 hit for monomerid = 12071
Trg + Lig
Ki
nM
ΔG°
kcal/mole
IC50
nM
Kd
nM
EC50/IC50
nM
koff
s-1
kon
M-1s-1
pHTemp
°C
Caspase-1
(Homo sapiens (Human))
BDBM12071
(4-[4-(2-{[(2S)-1-carboxy-3-oxopropan-2-yl]sulfamoy...)
Show SMILES OC(=O)C[C@H](NS(=O)(=O)c1ccccc1Oc1ccc(cc1)-c1ccc(cc1)C(O)=O)C=O |r|
Show InChI InChI=1S/C23H19NO8S/c25-14-18(13-22(26)27)24-33(30,31)21-4-2-1-3-20(21)32-19-11-9-16(10-12-19)15-5-7-17(8-6-15)23(28)29/h1-12,14,18,24H,13H2,(H,26,27)(H,28,29)/t18-/m0/s1
NCI pathway
Reactome pathway
4.20E+3 -7.62n/an/an/an/an/a7.037
Pfizer
Assay Description
The substrate peptides terminating in AMC are processed by caspases with or without inhibitors, and the accumulation of AMC was assessed with a Cytof...
Bioorg Med Chem Lett 11: 2779-82 (2001)
Article DOI: 10.1016/s0960-894x(01)00573-x
BindingDB Entry DOI: 10.7270/Q26W9896