BDBM1208 2-Aminobenzyl-Substituted AHPPA deriv. 2::benzyl N-[(1S)-1-{[(2S,3R,4R)-3-hydroxy-4-{[(1S,2R)-2-hydroxy-2,3-dihydro-1H-inden-1-yl]carbamoyl}-4-{[(4-methoxyphenyl)methyl]amino}-1-phenylbutan-2-yl]carbamoyl}-2,2-dimethylpropyl]carbamate
SMILES: COc1ccc(CN[C@H]([C@H](O)[C@H](Cc2ccccc2)NC(=O)[C@@H](NC(=O)OCc2ccccc2)C(C)(C)C)C(=O)N[C@@H]2[C@H](O)Cc3ccccc23)cc1
InChI Key: InChIKey=ZVWSWYSIMOZTTG-QVDBQUMVSA-N
Data: 2 KI  1 IC50
Activity Spreadsheet -- Enzyme Inhibition Constant Data from BindingDB
Found 2 hits for monomerid = 1208
Trg + Lig
Ki
nM
ΔG°
kcal/mole
IC50
nM
Kd
nM
EC50/IC50
nM
koff
s-1
kon
M-1s-1
pHTemp
°C
HIV-1 Protease
(Human immunodeficiency virus type 1)
BDBM1208
(2-Aminobenzyl-Substituted AHPPA deriv. 2 | benzyl ...)
Show SMILES COc1ccc(CN[C@H]([C@H](O)[C@H](Cc2ccccc2)NC(=O)[C@@H](NC(=O)OCc2ccccc2)C(C)(C)C)C(=O)N[C@@H]2[C@H](O)Cc3ccccc23)cc1 |r|
Show InChI InChI=1S/C42H50N4O7/c1-42(2,3)38(46-41(51)53-26-29-15-9-6-10-16-29)40(50)44-33(23-27-13-7-5-8-14-27)37(48)36(43-25-28-19-21-31(52-4)22-20-28)39(49)45-35-32-18-12-11-17-30(32)24-34(35)47/h5-22,33-38,43,47-48H,23-26H2,1-4H3,(H,44,50)(H,45,49)(H,46,51)/t33-,34+,35-,36+,37+,38+/m0/s1
9.5 -11.4 254n/an/an/an/a6.2537
Sandoz Research Institute
Assay Description
Enzymatic activity was measured by following cleavage of the substrate H-Lys-Ala-Arg-Val-Leu-pNph-Glu-Ala-Nle-NH2. Products of the cleavage reaction ...
J Med Chem 39: 2060-7 (1996)
Article DOI: 10.1021/jm9508696
BindingDB Entry DOI: 10.7270/Q2VT1Q89
Human immunodeficiency virus type 1 protease
(Human immunodeficiency virus type 1)
BDBM1208
(2-Aminobenzyl-Substituted AHPPA deriv. 2 | benzyl ...)
Show SMILES COc1ccc(CN[C@H]([C@H](O)[C@H](Cc2ccccc2)NC(=O)[C@@H](NC(=O)OCc2ccccc2)C(C)(C)C)C(=O)N[C@@H]2[C@H](O)Cc3ccccc23)cc1 |r|
Show InChI InChI=1S/C42H50N4O7/c1-42(2,3)38(46-41(51)53-26-29-15-9-6-10-16-29)40(50)44-33(23-27-13-7-5-8-14-27)37(48)36(43-25-28-19-21-31(52-4)22-20-28)39(49)45-35-32-18-12-11-17-30(32)24-34(35)47/h5-22,33-38,43,47-48H,23-26H2,1-4H3,(H,44,50)(H,45,49)(H,46,51)/t33-,34+,35-,36+,37+,38+/m0/s1
1.82E+3n/an/an/an/an/an/an/an/a
SANDOZ Forschungsinstitut Ges. m.b.H
Curated by ChEMBL
Assay Description
Inhibitory activity was determined against HIV type 1 protease
J Med Chem 38: 4917-28 (1996)
BindingDB Entry DOI: 10.7270/Q2FX7BN8