BDBM120855 US8716478, D241::US9499570, D241
SMILES: CC(C)OCCOc1nc(Oc2ccc3B(O)OCc3c2)cc(c1C#N)C(F)(F)F
InChI Key: InChIKey=DSHINXNFGWBHRA-UHFFFAOYSA-N
Data: 2 IC50
Activity Spreadsheet -- Enzyme Inhibition Constant Data from BindingDB
Found 2 hits for monomerid = 120855
Trg + Lig
Ki
nM
ΔG°
kcal/mole
IC50
nM
Kd
nM
EC50/IC50
nM
koff
s-1
kon
M-1s-1
pHTemp
°C
cAMP-specific 3',5'-cyclic phosphodiesterase 4B
(Homo sapiens (Human))
BDBM120855
(US8716478, D241 | US9499570, D241)
Show SMILES CC(C)OCCOc1nc(Oc2ccc3B(O)OCc3c2)cc(c1C#N)C(F)(F)F
Show InChI InChI=1S/C19H18BF3N2O5/c1-11(2)27-5-6-28-18-14(9-24)15(19(21,22)23)8-17(25-18)30-13-3-4-16-12(7-13)10-29-20(16)26/h3-4,7-8,11,26H,5-6,10H2,1-2H3
US Patent
n/an/a 1.10n/an/an/an/a7.5n/a
Anacor Pharmaceuticals, Inc.
US Patent
Assay Description
Inhibition of the human PDE4 enzyme, using semi-purified enzyme from human U937 cells. The PDE4 enzyme was partially purified from human U937 myeloid...
US Patent US9499570 (2016)
BindingDB Entry DOI: 10.7270/Q2CZ363N
cAMP-specific 3',5'-cyclic phosphodiesterase 4A
(Homo sapiens (Human))
BDBM120855
(US8716478, D241 | US9499570, D241)
Show SMILES CC(C)OCCOc1nc(Oc2ccc3B(O)OCc3c2)cc(c1C#N)C(F)(F)F
Show InChI InChI=1S/C19H18BF3N2O5/c1-11(2)27-5-6-28-18-14(9-24)15(19(21,22)23)8-17(25-18)30-13-3-4-16-12(7-13)10-29-20(16)26/h3-4,7-8,11,26H,5-6,10H2,1-2H3
US Patent
n/an/a 1.10n/an/an/an/a7.537
Anacor Pharmaceuticals, Inc.
US Patent
Assay Description
Inhibition of the human PDE4 enzyme, using semi-purified enzyme from human U937 cells. The PDE4 enzyme was partially purified from human U937 myeloid...
US Patent US8716478 (2014)
BindingDB Entry DOI: 10.7270/Q2Z60MQ7