BDBM120904 US8716287, 37
SMILES: COc1cc(CCNCc2ccc(F)cc2)c(Cl)cc1NC(=O)Nc1cnc(cn1)C#N
InChI Key: InChIKey=HBPTVKMQBJZJSU-UHFFFAOYSA-N
Data: 1 IC50
Activity Spreadsheet -- Enzyme Inhibition Constant Data from BindingDB
Found 1 hit for monomerid = 120904
Trg + Lig
Ki
nM
ΔG°
kcal/mole
IC50
nM
Kd
nM
EC50/IC50
nM
koff
s-1
kon
M-1s-1
pHTemp
°C
Serine/threonine-protein kinase Chk1
(Homo sapiens (Human))
BDBM120904
(US8716287, 37)
Show SMILES COc1cc(CCNCc2ccc(F)cc2)c(Cl)cc1NC(=O)Nc1cnc(cn1)C#N
Show InChI InChI=1S/C22H20ClFN6O2/c1-32-20-8-15(6-7-26-11-14-2-4-16(24)5-3-14)18(23)9-19(20)29-22(31)30-21-13-27-17(10-25)12-28-21/h2-5,8-9,12-13,26H,6-7,11H2,1H3,(H2,28,29,30,31)
Reactome pathway
US Patent
n/an/a 1.60n/an/an/an/a7.5n/a
Sentinel Oncology Limited
US Patent
Assay Description
The compounds of the invention were tested for activity against Chk-1 kinase using the materials and protocols set out below. Reaction Buffer: Base R...
US Patent US8716287 (2014)
BindingDB Entry DOI: 10.7270/Q2TD9W0C