BDBM12093 3-Amino-1,4,5,6-tetrahydropyrrolo[3,4-c]pyrazole 11::N-{5-acetyl-1H,4H,5H,6H-pyrrolo[3,4-c]pyrazol-3-yl}-2-phenylacetamide
SMILES: CC(=O)N1Cc2n[nH]c(NC(=O)Cc3ccccc3)c2C1
InChI Key: InChIKey=SFYXQHJWZIXJLT-UHFFFAOYSA-N
Data: 2 IC50
Activity Spreadsheet -- Enzyme Inhibition Constant Data from BindingDB
Found 2 hits for monomerid = 12093
Trg + Lig
Ki
nM
ΔG°
kcal/mole
IC50
nM
Kd
nM
EC50/IC50
nM
koff
s-1
kon
M-1s-1
pHTemp
°C
Aurora kinase A
(Homo sapiens (Human))
BDBM12093
(3-Amino-1,4,5,6-tetrahydropyrrolo[3,4-c]pyrazole 1...)
Show SMILES CC(=O)N1Cc2n[nH]c(NC(=O)Cc3ccccc3)c2C1
Show InChI InChI=1S/C15H16N4O2/c1-10(20)19-8-12-13(9-19)17-18-15(12)16-14(21)7-11-5-3-2-4-6-11/h2-6H,7-9H2,1H3,(H2,16,17,18,21)
NCI pathway
Reactome pathway
n/an/a 2.31E+3n/an/an/an/an/an/a
Nerviano Medical Sciences
Assay Description
The biochemical activity of compounds was determined by incubation with specific enzymes and substrates in the presence ATP/[gamma-33P] ATP. After in...
Bioorg Med Chem Lett 16: 1084-90 (2006)
Article DOI: 10.1016/j.bmcl.2005.10.071
BindingDB Entry DOI: 10.7270/Q2PZ5725
Cyclin-Dependent Kinase 2 (CDK2)
(Homo sapiens (Human))
BDBM12093
(3-Amino-1,4,5,6-tetrahydropyrrolo[3,4-c]pyrazole 1...)
Show SMILES CC(=O)N1Cc2n[nH]c(NC(=O)Cc3ccccc3)c2C1
Show InChI InChI=1S/C15H16N4O2/c1-10(20)19-8-12-13(9-19)17-18-15(12)16-14(21)7-11-5-3-2-4-6-11/h2-6H,7-9H2,1H3,(H2,16,17,18,21)
NCI pathway
Reactome pathway
n/an/a 440n/an/an/an/a7.422
Nerviano Medical Sciences
Assay Description
The biochemical activity of compounds was determined by incubation with specific enzymes and substrates in the presence ATP/[gamma-33P] ATP. After in...
Bioorg Med Chem Lett 16: 1084-90 (2006)
Article DOI: 10.1016/j.bmcl.2005.10.071
BindingDB Entry DOI: 10.7270/Q2PZ5725