BDBM12094 3-Amino-1,4,5,6-tetrahydropyrrolo[3,4-c]pyrazole 12::N-phenyl-3-(2-phenylacetamido)-1H,4H,5H,6H-pyrrolo[3,4-c]pyrazole-5-carboxamide
SMILES: O=C(Cc1ccccc1)Nc1[nH]nc2CN(Cc12)C(=O)Nc1ccccc1
InChI Key: InChIKey=QAROPOMHRWJDMK-UHFFFAOYSA-N
Data: 2 IC50
Activity Spreadsheet -- Enzyme Inhibition Constant Data from BindingDB
Found 2 hits for monomerid = 12094
Trg + Lig
Ki
nM
ΔG°
kcal/mole
IC50
nM
Kd
nM
EC50/IC50
nM
koff
s-1
kon
M-1s-1
pHTemp
°C
Aurora kinase A
(Homo sapiens (Human))
BDBM12094
(3-Amino-1,4,5,6-tetrahydropyrrolo[3,4-c]pyrazole 1...)
Show SMILES O=C(Cc1ccccc1)Nc1[nH]nc2CN(Cc12)C(=O)Nc1ccccc1
Show InChI InChI=1S/C20H19N5O2/c26-18(11-14-7-3-1-4-8-14)22-19-16-12-25(13-17(16)23-24-19)20(27)21-15-9-5-2-6-10-15/h1-10H,11-13H2,(H,21,27)(H2,22,23,24,26)
NCI pathway
Reactome pathway
n/an/a>1.00E+4n/an/an/an/an/an/a
Nerviano Medical Sciences
Assay Description
The biochemical activity of compounds was determined by incubation with specific enzymes and substrates in the presence ATP/[gamma-33P] ATP. After in...
Bioorg Med Chem Lett 16: 1084-90 (2006)
Article DOI: 10.1016/j.bmcl.2005.10.071
BindingDB Entry DOI: 10.7270/Q2PZ5725
Cyclin-Dependent Kinase 2 (CDK2)
(Homo sapiens (Human))
BDBM12094
(3-Amino-1,4,5,6-tetrahydropyrrolo[3,4-c]pyrazole 1...)
Show SMILES O=C(Cc1ccccc1)Nc1[nH]nc2CN(Cc12)C(=O)Nc1ccccc1
Show InChI InChI=1S/C20H19N5O2/c26-18(11-14-7-3-1-4-8-14)22-19-16-12-25(13-17(16)23-24-19)20(27)21-15-9-5-2-6-10-15/h1-10H,11-13H2,(H,21,27)(H2,22,23,24,26)
NCI pathway
Reactome pathway
n/an/a 730n/an/an/an/a7.422
Nerviano Medical Sciences
Assay Description
The biochemical activity of compounds was determined by incubation with specific enzymes and substrates in the presence ATP/[gamma-33P] ATP. After in...
Bioorg Med Chem Lett 16: 1084-90 (2006)
Article DOI: 10.1016/j.bmcl.2005.10.071
BindingDB Entry DOI: 10.7270/Q2PZ5725