BDBM12108 1,4,5,6-Tetrahydropyrrolo[3,4-c]pyrazole 16::CHEMBL427170::N-[5-(Furan-2-carbonyl)-1,4,5,6-tetrahydro-pyrrolo[3,4-c]pyrazol-3-yl]-4-(4-methyl-piperazin-1-yl)-benzamide::N-[5-(furan-2-ylcarbonyl)-1H,4H,5H,6H-pyrrolo[3,4-c]pyrazol-3-yl]-4-(4-methylpiperazin-1-yl)benzamide
SMILES: CN1CCN(CC1)c1ccc(cc1)C(=O)Nc1[nH]nc2CN(Cc12)C(=O)c1ccco1
InChI Key: InChIKey=CGKGJGLHSCEWHJ-UHFFFAOYSA-N
Data: 2 IC50
Activity Spreadsheet -- Enzyme Inhibition Constant Data from BindingDB
Found 2 hits for monomerid = 12108
Trg + Lig
Ki
nM
ΔG°
kcal/mole
IC50
nM
Kd
nM
EC50/IC50
nM
koff
s-1
kon
M-1s-1
pHTemp
°C
Aurora kinase A
(Homo sapiens (Human))
BDBM12108
(1,4,5,6-Tetrahydropyrrolo[3,4-c]pyrazole 16 | CHEM...)
Show SMILES CN1CCN(CC1)c1ccc(cc1)C(=O)Nc1[nH]nc2CN(Cc12)C(=O)c1ccco1
Show InChI InChI=1S/C22H24N6O3/c1-26-8-10-27(11-9-26)16-6-4-15(5-7-16)21(29)23-20-17-13-28(14-18(17)24-25-20)22(30)19-3-2-12-31-19/h2-7,12H,8-11,13-14H2,1H3,(H2,23,24,25,29)
NCI pathway
Reactome pathway
n/an/a 160n/an/an/an/an/an/a
Vertex Pharmaceuticals (Europe) Ltd.
Curated by ChEMBL
Assay Description
Inhibition of aurora A kinase
J Med Chem 52: 2629-51 (2009)
Checked by Author
Article DOI: 10.1021/jm8012129
BindingDB Entry DOI: 10.7270/Q2B85920
Aurora kinase A
(Homo sapiens (Human))
BDBM12108
(1,4,5,6-Tetrahydropyrrolo[3,4-c]pyrazole 16 | CHEM...)
Show SMILES CN1CCN(CC1)c1ccc(cc1)C(=O)Nc1[nH]nc2CN(Cc12)C(=O)c1ccco1
Show InChI InChI=1S/C22H24N6O3/c1-26-8-10-27(11-9-26)16-6-4-15(5-7-16)21(29)23-20-17-13-28(14-18(17)24-25-20)22(30)19-3-2-12-31-19/h2-7,12H,8-11,13-14H2,1H3,(H2,23,24,25,29)
NCI pathway
Reactome pathway
n/an/a 160n/an/an/an/a7.522
Nerviano Medical Sciences
Assay Description
The biochemical activity of compounds was determined by incubation with specific enzymes and substrates in the presence ATP/[gamma-33P] ATP. After in...
J Med Chem 48: 3080-4 (2005)
Article DOI: 10.1021/jm049076m
BindingDB Entry DOI: 10.7270/Q2FF3QKK