BDBM12217 (2R,3R,5R)-2,5-bis(benzyloxy)-3-hydroxy-N,N'-bis[(1S,2R)-2-hydroxy-2,3-dihydro-1H-inden-1-yl]hexanediamide::symmetric/asymmetric inhibitor 4
SMILES: O[C@H](C[C@@H](OCc1ccccc1)C(=O)N[C@@H]1[C@H](O)Cc2ccccc12)[C@@H](OCc1ccccc1)C(=O)N[C@@H]1[C@H](O)Cc2ccccc12
InChI Key: InChIKey=AHAVBKNGKPWROK-UMFPTGFGSA-N
Data: 1 KI
PDB links: 1 PDB ID matches this monomer. 6 PDB IDs contain this monomer as substructures. 6 PDB IDs contain inhibitors having a similarity of 90% to this monomer.
Activity Spreadsheet -- Enzyme Inhibition Constant Data from BindingDB
Found 1 hit for monomerid = 12217
Trg + Lig
Ki
nM
ΔG°
kcal/mole
IC50
nM
Kd
nM
EC50/IC50
nM
koff
s-1
kon
M-1s-1
pHTemp
°C
HIV-1 Protease
(Human immunodeficiency virus type 1)
BDBM12217
((2R,3R,5R)-2,5-bis(benzyloxy)-3-hydroxy-N,N'-bis[(...)
Show SMILES O[C@H](C[C@@H](OCc1ccccc1)C(=O)N[C@@H]1[C@H](O)Cc2ccccc12)[C@@H](OCc1ccccc1)C(=O)N[C@@H]1[C@H](O)Cc2ccccc12 |r|
Show InChI InChI=1S/C38H40N2O7/c41-30-19-26-15-7-9-17-28(26)34(30)39-37(44)33(46-22-24-11-3-1-4-12-24)21-32(43)36(47-23-25-13-5-2-6-14-25)38(45)40-35-29-18-10-8-16-27(29)20-31(35)42/h1-18,30-36,41-43H,19-23H2,(H,39,44)(H,40,45)/t30-,31-,32-,33-,34+,35+,36-/m1/s1
1.40 -12.3n/an/an/an/an/a5.030
Uppsala University
Assay Description
A fluorimetric assay was used to determine the effects of the inhibitors on HIV-1 protease. This assay used an internally quenched fluorescent peptid...
Eur J Biochem 270: 1746-58 (2003)
Article DOI: 10.1046/j.1432-1033.2003.03533.x
BindingDB Entry DOI: 10.7270/Q2NZ85WX
3D
3D Structure (crystal)