BDBM12231 AZD0530 analogue 9::N-(2-chloro-5-methoxyphenyl)-7-[3-(morpholin-4-yl)propoxy]-5-(oxolan-3-yloxy)quinazolin-4-amine
SMILES: COc1ccc(Cl)c(Nc2ncnc3cc(OCCCN4CCOCC4)cc(OC4CCOC4)c23)c1
InChI Key: InChIKey=DWMMULHPJUKYRJ-UHFFFAOYSA-N
Data: 2 IC50
Activity Spreadsheet -- Enzyme Inhibition Constant Data from BindingDB
Found 2 hits for monomerid = 12231
Trg + Lig
Ki
nM
ΔG°
kcal/mole
IC50
nM
Kd
nM
EC50/IC50
nM
koff
s-1
kon
M-1s-1
pHTemp
°C
Vascular endothelial growth factor receptor 2
(Homo sapiens (Human))
BDBM12231
(AZD0530 analogue 9 | N-(2-chloro-5-methoxyphenyl)-...)
Show SMILES COc1ccc(Cl)c(Nc2ncnc3cc(OCCCN4CCOCC4)cc(OC4CCOC4)c23)c1
Show InChI InChI=1S/C26H31ClN4O5/c1-32-18-3-4-21(27)22(13-18)30-26-25-23(28-17-29-26)14-20(15-24(25)36-19-5-10-34-16-19)35-9-2-6-31-7-11-33-12-8-31/h3-4,13-15,17,19H,2,5-12,16H2,1H3,(H,28,29,30)
NCI pathway
Reactome pathway
n/an/a 50n/an/an/an/an/an/a
AstraZeneca
Assay Description
An ELISA assay was used to determine the ability of inhibitor to inhibit VEGF-R RTK activity. The compounds were incubated with enzyme 20 min at room...
J Med Chem 49: 6465-88 (2006)
Article DOI: 10.1021/jm060434q
BindingDB Entry DOI: 10.7270/Q2J67F5X
Proto-oncogene tyrosine-protein kinase Src
(Homo sapiens (Human))
BDBM12231
(AZD0530 analogue 9 | N-(2-chloro-5-methoxyphenyl)-...)
Show SMILES COc1ccc(Cl)c(Nc2ncnc3cc(OCCCN4CCOCC4)cc(OC4CCOC4)c23)c1
Show InChI InChI=1S/C26H31ClN4O5/c1-32-18-3-4-21(27)22(13-18)30-26-25-23(28-17-29-26)14-20(15-24(25)36-19-5-10-34-16-19)35-9-2-6-31-7-11-33-12-8-31/h3-4,13-15,17,19H,2,5-12,16H2,1H3,(H,28,29,30)
n/an/a<4n/an/an/an/a7.422
AstraZeneca
Assay Description
This assay determines the ability of test compounds to inhibit Src kinase activity that catalyzes the transfer of the terminal phosphate to the immob...
J Med Chem 49: 6465-88 (2006)
Article DOI: 10.1021/jm060434q
BindingDB Entry DOI: 10.7270/Q2J67F5X