null
SMILES: COc1cc(cnc1OC)-c1cnc2ccccn12
InChI Key: InChIKey=HEUACGNYCRBEIM-UHFFFAOYSA-N
Activity Spreadsheet -- Enzyme Inhibition Constant Data from BindingDB
Found 2 hits for monomerid = 122466
Trg + Lig
Ki
nM
ΔG°
kcal/mole
IC50
nM
Kd
nM
EC50/IC50
nM
koff
s-1
kon
M-1s-1
pHTemp
°C
Phosphatidylinositol 4,5-bisphosphate 3-kinase catalytic subunit alpha isoform
(Homo sapiens (Human))
BDBM122466
(US8729074, 10)
Show SMILES COc1cc(cnc1OC)-c1cnc2ccccn12
Show InChI InChI=1S/C14H13N3O2/c1-18-12-7-10(8-16-14(12)19-2)11-9-15-13-5-3-4-6-17(11)13/h3-9H,1-2H3
NCI pathway
Reactome pathway
US Patent
>1.50E+3n/a 1.57E+4n/an/an/an/an/an/a
Amgen Inc.
US Patent
Assay Description
The PI3K AlphaScreen assay (PerkinElmer, Waltham, Mass.) measures the activity of a panel of four phosphoinositide 3-kinases: PI3Kα, PI3Kβ,...
US Patent US8729074 (2014)
BindingDB Entry DOI: 10.7270/Q2RJ4H4G
Serine/threonine-protein kinase mTOR
(Homo sapiens (Human))
BDBM122466
(US8729074, 10)
Show SMILES COc1cc(cnc1OC)-c1cnc2ccccn12
Show InChI InChI=1S/C14H13N3O2/c1-18-12-7-10(8-16-14(12)19-2)11-9-15-13-5-3-4-6-17(11)13/h3-9H,1-2H3
NCI pathway
Reactome pathway
US Patent
n/an/a>5.00E+4n/an/an/an/an/an/a
Amgen Inc.
US Patent
Assay Description
The Invitrogen (Carlsbad, Calif.) mammalian target of rapamycin (mTOR) Lanthascreen assay can be used to quantitate mTOR kinase activity in an in vit...
US Patent US8729074 (2014)
BindingDB Entry DOI: 10.7270/Q2RJ4H4G