BDBM122485 US8729061, 15
SMILES: CC[C@H](NC(=O)[C@@H]1C[C@H](CN1C(=O)C1(CC1)c1ccc(Br)cc1)S(=O)(=O)c1ccccc1Cl)C(=O)C(=O)NC1CC1
InChI Key: InChIKey=UHNROXZSASTRFP-PUHATCMVSA-N
Data: 4 IC50
Activity Spreadsheet -- Enzyme Inhibition Constant Data from BindingDB
Found 4 hits for monomerid = 122485
Trg + Lig
Ki
nM
ΔG°
kcal/mole
IC50
nM
Kd
nM
EC50/IC50
nM
koff
s-1
kon
M-1s-1
pHTemp
°C
Cathepsin S
(Homo sapiens (Human))
BDBM122485
(US8729061, 15)
Show SMILES CC[C@H](NC(=O)[C@@H]1C[C@H](CN1C(=O)C1(CC1)c1ccc(Br)cc1)S(=O)(=O)c1ccccc1Cl)C(=O)C(=O)NC1CC1 |r|
Show InChI InChI=1S/C29H31BrClN3O6S/c1-2-22(25(35)27(37)32-19-11-12-19)33-26(36)23-15-20(41(39,40)24-6-4-3-5-21(24)31)16-34(23)28(38)29(13-14-29)17-7-9-18(30)10-8-17/h3-10,19-20,22-23H,2,11-16H2,1H3,(H,32,37)(H,33,36)/t20-,22+,23+/m1/s1
Reactome pathway
US Patent
n/an/a 0.520n/an/an/an/a6.5n/a
Hoffmann-La Roche Inc.
US Patent
Assay Description
Enzyme activity is measured by observing the increase in fluorescence intensity caused by cleavage of a peptide substrate containing a fluorophore wh...
US Patent US8729061 (2014)
BindingDB Entry DOI: 10.7270/Q2MS3RF6
Cathepsin B
(Homo sapiens (Human))
BDBM122485
(US8729061, 15)
Show SMILES CC[C@H](NC(=O)[C@@H]1C[C@H](CN1C(=O)C1(CC1)c1ccc(Br)cc1)S(=O)(=O)c1ccccc1Cl)C(=O)C(=O)NC1CC1 |r|
Show InChI InChI=1S/C29H31BrClN3O6S/c1-2-22(25(35)27(37)32-19-11-12-19)33-26(36)23-15-20(41(39,40)24-6-4-3-5-21(24)31)16-34(23)28(38)29(13-14-29)17-7-9-18(30)10-8-17/h3-10,19-20,22-23H,2,11-16H2,1H3,(H,32,37)(H,33,36)/t20-,22+,23+/m1/s1
Reactome pathway
US Patent
n/an/a 98.5n/an/an/an/a6.5n/a
Hoffmann-La Roche Inc.
US Patent
Assay Description
Enzyme activity is measured by observing the increase in fluorescence intensity caused by cleavage of a peptide substrate containing a fluorophore wh...
US Patent US8729061 (2014)
BindingDB Entry DOI: 10.7270/Q2MS3RF6
Cathepsin K
(Homo sapiens (Human))
BDBM122485
(US8729061, 15)
Show SMILES CC[C@H](NC(=O)[C@@H]1C[C@H](CN1C(=O)C1(CC1)c1ccc(Br)cc1)S(=O)(=O)c1ccccc1Cl)C(=O)C(=O)NC1CC1 |r|
Show InChI InChI=1S/C29H31BrClN3O6S/c1-2-22(25(35)27(37)32-19-11-12-19)33-26(36)23-15-20(41(39,40)24-6-4-3-5-21(24)31)16-34(23)28(38)29(13-14-29)17-7-9-18(30)10-8-17/h3-10,19-20,22-23H,2,11-16H2,1H3,(H,32,37)(H,33,36)/t20-,22+,23+/m1/s1
Reactome pathway
US Patent
n/an/a 44.8n/an/an/an/a6.5n/a
Hoffmann-La Roche Inc.
US Patent
Assay Description
Enzyme activity is measured by observing the increase in fluorescence intensity caused by cleavage of a peptide substrate containing a fluorophore wh...
US Patent US8729061 (2014)
BindingDB Entry DOI: 10.7270/Q2MS3RF6
Procathepsin L
(Homo sapiens (Human))
BDBM122485
(US8729061, 15)
Show SMILES CC[C@H](NC(=O)[C@@H]1C[C@H](CN1C(=O)C1(CC1)c1ccc(Br)cc1)S(=O)(=O)c1ccccc1Cl)C(=O)C(=O)NC1CC1 |r|
Show InChI InChI=1S/C29H31BrClN3O6S/c1-2-22(25(35)27(37)32-19-11-12-19)33-26(36)23-15-20(41(39,40)24-6-4-3-5-21(24)31)16-34(23)28(38)29(13-14-29)17-7-9-18(30)10-8-17/h3-10,19-20,22-23H,2,11-16H2,1H3,(H,32,37)(H,33,36)/t20-,22+,23+/m1/s1
Reactome pathway
US Patent
n/an/a 8.20n/an/an/an/a6.5n/a
Hoffmann-La Roche Inc.
US Patent
Assay Description
Enzyme activity is measured by observing the increase in fluorescence intensity caused by cleavage of a peptide substrate containing a fluorophore wh...
US Patent US8729061 (2014)
BindingDB Entry DOI: 10.7270/Q2MS3RF6