BDBM122511 US8729061, 41
SMILES: CCC[C@H](NC(=O)[C@@H]1C[C@H](CN1C(=O)C1(CC1)c1ccc(Cl)cc1)S(=O)(=O)c1ccccc1Cl)C(=O)C(=O)NC(C)C
InChI Key: InChIKey=HDQBKIWKLLGTGO-NHTMILBNSA-N
Data: 4 IC50
Activity Spreadsheet -- Enzyme Inhibition Constant Data from BindingDB
Found 4 hits for monomerid = 122511
Trg + Lig
Ki
nM
ΔG°
kcal/mole
IC50
nM
Kd
nM
EC50/IC50
nM
koff
s-1
kon
M-1s-1
pHTemp
°C
Cathepsin S
(Homo sapiens (Human))
BDBM122511
(US8729061, 41)
Show SMILES CCC[C@H](NC(=O)[C@@H]1C[C@H](CN1C(=O)C1(CC1)c1ccc(Cl)cc1)S(=O)(=O)c1ccccc1Cl)C(=O)C(=O)NC(C)C |r|
Show InChI InChI=1S/C30H35Cl2N3O6S/c1-4-7-23(26(36)28(38)33-18(2)3)34-27(37)24-16-21(42(40,41)25-9-6-5-8-22(25)32)17-35(24)29(39)30(14-15-30)19-10-12-20(31)13-11-19/h5-6,8-13,18,21,23-24H,4,7,14-17H2,1-3H3,(H,33,38)(H,34,37)/t21-,23+,24+/m1/s1
Reactome pathway
US Patent
n/an/a 0.568n/an/an/an/a6.5n/a
Hoffmann-La Roche Inc.
US Patent
Assay Description
Enzyme activity is measured by observing the increase in fluorescence intensity caused by cleavage of a peptide substrate containing a fluorophore wh...
US Patent US8729061 (2014)
BindingDB Entry DOI: 10.7270/Q2MS3RF6
Cathepsin B
(Homo sapiens (Human))
BDBM122511
(US8729061, 41)
Show SMILES CCC[C@H](NC(=O)[C@@H]1C[C@H](CN1C(=O)C1(CC1)c1ccc(Cl)cc1)S(=O)(=O)c1ccccc1Cl)C(=O)C(=O)NC(C)C |r|
Show InChI InChI=1S/C30H35Cl2N3O6S/c1-4-7-23(26(36)28(38)33-18(2)3)34-27(37)24-16-21(42(40,41)25-9-6-5-8-22(25)32)17-35(24)29(39)30(14-15-30)19-10-12-20(31)13-11-19/h5-6,8-13,18,21,23-24H,4,7,14-17H2,1-3H3,(H,33,38)(H,34,37)/t21-,23+,24+/m1/s1
Reactome pathway
US Patent
n/an/a 187n/an/an/an/a6.5n/a
Hoffmann-La Roche Inc.
US Patent
Assay Description
Enzyme activity is measured by observing the increase in fluorescence intensity caused by cleavage of a peptide substrate containing a fluorophore wh...
US Patent US8729061 (2014)
BindingDB Entry DOI: 10.7270/Q2MS3RF6
Cathepsin K
(Homo sapiens (Human))
BDBM122511
(US8729061, 41)
Show SMILES CCC[C@H](NC(=O)[C@@H]1C[C@H](CN1C(=O)C1(CC1)c1ccc(Cl)cc1)S(=O)(=O)c1ccccc1Cl)C(=O)C(=O)NC(C)C |r|
Show InChI InChI=1S/C30H35Cl2N3O6S/c1-4-7-23(26(36)28(38)33-18(2)3)34-27(37)24-16-21(42(40,41)25-9-6-5-8-22(25)32)17-35(24)29(39)30(14-15-30)19-10-12-20(31)13-11-19/h5-6,8-13,18,21,23-24H,4,7,14-17H2,1-3H3,(H,33,38)(H,34,37)/t21-,23+,24+/m1/s1
Reactome pathway
US Patent
n/an/a 152n/an/an/an/a6.5n/a
Hoffmann-La Roche Inc.
US Patent
Assay Description
Enzyme activity is measured by observing the increase in fluorescence intensity caused by cleavage of a peptide substrate containing a fluorophore wh...
US Patent US8729061 (2014)
BindingDB Entry DOI: 10.7270/Q2MS3RF6
Procathepsin L
(Homo sapiens (Human))
BDBM122511
(US8729061, 41)
Show SMILES CCC[C@H](NC(=O)[C@@H]1C[C@H](CN1C(=O)C1(CC1)c1ccc(Cl)cc1)S(=O)(=O)c1ccccc1Cl)C(=O)C(=O)NC(C)C |r|
Show InChI InChI=1S/C30H35Cl2N3O6S/c1-4-7-23(26(36)28(38)33-18(2)3)34-27(37)24-16-21(42(40,41)25-9-6-5-8-22(25)32)17-35(24)29(39)30(14-15-30)19-10-12-20(31)13-11-19/h5-6,8-13,18,21,23-24H,4,7,14-17H2,1-3H3,(H,33,38)(H,34,37)/t21-,23+,24+/m1/s1
Reactome pathway
US Patent
n/an/a 11.7n/an/an/an/a6.5n/a
Hoffmann-La Roche Inc.
US Patent
Assay Description
Enzyme activity is measured by observing the increase in fluorescence intensity caused by cleavage of a peptide substrate containing a fluorophore wh...
US Patent US8729061 (2014)
BindingDB Entry DOI: 10.7270/Q2MS3RF6