BDBM123000 US8742158, EX 17
SMILES: CC(C)CN([C@H](CO)CCCCNC(=O)[C@H](Cc1ccccc1Br)NC(=O)N1CCOCC1)S(=O)(=O)c1ccc2OCCc2c1
InChI Key: InChIKey=GUWKDCYJUXVTEE-WNJJXGMVSA-N
Data: 1 IC50
Activity Spreadsheet -- Enzyme Inhibition Constant Data from BindingDB
Found 1 hit for monomerid = 123000
Trg + Lig
Ki
nM
ΔG°
kcal/mole
IC50
nM
Kd
nM
EC50/IC50
nM
koff
s-1
kon
M-1s-1
pHTemp
°C
Gag-Pol polyprotein [489-587,G537V,H558K,V571A]
(Human immunodeficiency virus)
BDBM123000
(US8742158, EX 17)
Show SMILES CC(C)CN([C@H](CO)CCCCNC(=O)[C@H](Cc1ccccc1Br)NC(=O)N1CCOCC1)S(=O)(=O)c1ccc2OCCc2c1 |r|
Show InChI InChI=1S/C32H45BrN4O7S/c1-23(2)21-37(45(41,42)27-10-11-30-25(19-27)12-16-44-30)26(22-38)8-5-6-13-34-31(39)29(20-24-7-3-4-9-28(24)33)35-32(40)36-14-17-43-18-15-36/h3-4,7,9-11,19,23,26,29,38H,5-6,8,12-18,20-22H2,1-2H3,(H,34,39)(H,35,40)/t26-,29-/m0/s1
US Patent
n/an/a 0.599n/an/an/an/an/an/a
TaiMed Biologies, Inc.
US Patent
Assay Description
This is a fluorometric assay based on the cleavage by protease of a substrate carrying a donor group (EDANS) and an acceptor group (DABCYL) on each s...
US Patent US8742158 (2014)
BindingDB Entry DOI: 10.7270/Q27H1H7P