BDBM123357 US8742106, 4.7
SMILES: C[C@H](NC(=O)COc1cc(C)c2c(nn(C)c2n1)-c1ncccn1)c1ccc(C)cc1
InChI Key: InChIKey=XEHRVSMGEOQPQE-INIZCTEOSA-N
Data: 2 KI  2 Kd
Activity Spreadsheet -- Enzyme Inhibition Constant Data from BindingDB
Found 4 hits for monomerid = 123357
Trg + Lig
Ki
nM
ΔG°
kcal/mole
IC50
nM
Kd
nM
EC50/IC50
nM
koff
s-1
kon
M-1s-1
pHTemp
°C
Orexin receptor type 1
(Homo sapiens (Human))
BDBM123357
(US8742106, 4.7)
Show SMILES C[C@H](NC(=O)COc1cc(C)c2c(nn(C)c2n1)-c1ncccn1)c1ccc(C)cc1 |r|
Show InChI InChI=1S/C23H24N6O2/c1-14-6-8-17(9-7-14)16(3)26-18(30)13-31-19-12-15(2)20-21(22-24-10-5-11-25-22)28-29(4)23(20)27-19/h5-12,16H,13H2,1-4H3,(H,26,30)/t16-/m0/s1
Reactome pathway
4n/an/an/an/an/an/an/an/a
Novartis Institutes for BioMedical Research
Curated by ChEMBL
Assay Description
Antagonist activity against human orexin 1 receptor after 1 hr by Ca2+ sensitive Fluo4-AM fluorescent dye-based FLIPR assay
Bioorg Med Chem Lett 25: 5555-60 (2015)
BindingDB Entry DOI: 10.7270/Q2WH2RVX
Orexin receptor type 2
(Homo sapiens (Human))
BDBM123357
(US8742106, 4.7)
Show SMILES C[C@H](NC(=O)COc1cc(C)c2c(nn(C)c2n1)-c1ncccn1)c1ccc(C)cc1 |r|
Show InChI InChI=1S/C23H24N6O2/c1-14-6-8-17(9-7-14)16(3)26-18(30)13-31-19-12-15(2)20-21(22-24-10-5-11-25-22)28-29(4)23(20)27-19/h5-12,16H,13H2,1-4H3,(H,26,30)/t16-/m0/s1
Reactome pathway
5n/an/an/an/an/an/an/an/a
Novartis Institutes for BioMedical Research
Curated by ChEMBL
Assay Description
Antagonist activity against human orexin 2 receptor after 1 hr by Ca2+ sensitive Fluo4-AM fluorescent dye-based FLIPR assay
Bioorg Med Chem Lett 25: 5555-60 (2015)
BindingDB Entry DOI: 10.7270/Q2WH2RVX
Orexin receptor type 2
(Homo sapiens (Human))
BDBM123357
(US8742106, 4.7)
Show SMILES C[C@H](NC(=O)COc1cc(C)c2c(nn(C)c2n1)-c1ncccn1)c1ccc(C)cc1 |r|
Show InChI InChI=1S/C23H24N6O2/c1-14-6-8-17(9-7-14)16(3)26-18(30)13-31-19-12-15(2)20-21(22-24-10-5-11-25-22)28-29(4)23(20)27-19/h5-12,16H,13H2,1-4H3,(H,26,30)/t16-/m0/s1
Reactome pathway
US Patent
n/an/an/a 13n/an/an/a7.54
Novartis AG
US Patent
Assay Description
For crude cell membrane preparations, cells (CHO, Chinese hamster ovary or HEK, human embryonic kidney) expressing human orexin 1 or human orexin 2 r...
US Patent US8742106 (2014)
BindingDB Entry DOI: 10.7270/Q22V2DSW
Orexin receptor type 1
(Homo sapiens (Human))
BDBM123357
(US8742106, 4.7)
Show SMILES C[C@H](NC(=O)COc1cc(C)c2c(nn(C)c2n1)-c1ncccn1)c1ccc(C)cc1 |r|
Show InChI InChI=1S/C23H24N6O2/c1-14-6-8-17(9-7-14)16(3)26-18(30)13-31-19-12-15(2)20-21(22-24-10-5-11-25-22)28-29(4)23(20)27-19/h5-12,16H,13H2,1-4H3,(H,26,30)/t16-/m0/s1
Reactome pathway
US Patent
n/an/an/a 11n/an/an/a7.54
Novartis AG
US Patent
Assay Description
For crude cell membrane preparations, cells (CHO, Chinese hamster ovary or HEK, human embryonic kidney) expressing human orexin 1 or human orexin 2 r...
US Patent US8742106 (2014)
BindingDB Entry DOI: 10.7270/Q22V2DSW