BDBM123456 US8741923, 15
SMILES: COCc1cc(ccc1-c1ccccc1C)-c1nc(no1)-c1ccc2CCNCc2c1
InChI Key: InChIKey=PHHFMCDOFPPCSB-UHFFFAOYSA-N
Data: 1 KI
Activity Spreadsheet -- Enzyme Inhibition Constant Data from BindingDB
Found 1 hit for monomerid = 123456
Trg + Lig
Ki
nM
ΔG°
kcal/mole
IC50
nM
Kd
nM
EC50/IC50
nM
koff
s-1
kon
M-1s-1
pHTemp
°C
Sphingosine 1-phosphate receptor 1
(Homo sapiens (Human))
BDBM123456
(US8741923, 15)
Show SMILES COCc1cc(ccc1-c1ccccc1C)-c1nc(no1)-c1ccc2CCNCc2c1
Show InChI InChI=1S/C26H25N3O2/c1-17-5-3-4-6-23(17)24-10-9-20(14-22(24)16-30-2)26-28-25(29-31-26)19-8-7-18-11-12-27-15-21(18)13-19/h3-10,13-14,27H,11-12,15-16H2,1-2H3
Reactome pathway
US Patent
1 -11.4n/an/an/an/an/a7.44
Merck Serono SA
US Patent
Assay Description
Receptor binding assay: Membranes were prepared from CHO cells expressing S1P1 or S1P3 for use in ligand and 35S-GTPγS binding studies. Cells we...
US Patent US8741923 (2014)
BindingDB Entry DOI: 10.7270/Q2PK0DVV