BDBM123593 US8748624, 92
SMILES: OC(=O)CCNC(=O)c1ccc(cn1)-c1cc(Cl)ccc1CNc1ccc(c(F)c1)-c1ccc(Cl)cc1Cl
InChI Key: InChIKey=RAGKIWSEXHHRTJ-UHFFFAOYSA-N
Data: 1 KI
Activity Spreadsheet -- Enzyme Inhibition Constant Data from BindingDB
Found 1 hit for monomerid = 123593
Trg + Lig
Ki
nM
ΔG°
kcal/mole
IC50
nM
Kd
nM
EC50/IC50
nM
koff
s-1
kon
M-1s-1
pHTemp
°C
Glucagon receptor
(Homo sapiens (Human))
BDBM123593
(US8748624, 92)
Show SMILES OC(=O)CCNC(=O)c1ccc(cn1)-c1cc(Cl)ccc1CNc1ccc(c(F)c1)-c1ccc(Cl)cc1Cl
Show InChI InChI=1S/C28H21Cl3FN3O3/c29-18-3-1-16(23(11-18)17-2-8-26(35-15-17)28(38)33-10-9-27(36)37)14-34-20-5-7-22(25(32)13-20)21-6-4-19(30)12-24(21)31/h1-8,11-13,15,34H,9-10,14H2,(H,33,38)(H,36,37)
US Patent
19.4n/an/an/an/an/an/a7.4n/a
Janssen Pharmaceutica NV
US Patent
Assay Description
The binding assay was performed by a filtration method in a 384 well format. Membranes at a final protein concentration of 6 μg/well were incuba...
US Patent US8748624 (2014)
BindingDB Entry DOI: 10.7270/Q29885QP