BDBM123682 US8748618, AI-10-53
SMILES: COc1cccnc1-c1nc2ccc(CO)cc2[nH]1
InChI Key: InChIKey=LPTNEAOJZHHLRG-UHFFFAOYSA-N
Data: 1 IC50
Activity Spreadsheet -- Enzyme Inhibition Constant Data from BindingDB
Found 1 hit for monomerid = 123682
Trg + Lig
Ki
nM
ΔG°
kcal/mole
IC50
nM
Kd
nM
EC50/IC50
nM
koff
s-1
kon
M-1s-1
pHTemp
°C
Core-binding factor subunit beta
(Homo sapiens (Human))
BDBM123682
(US8748618, AI-10-53)
Show SMILES COc1cccnc1-c1nc2ccc(CO)cc2[nH]1
Show InChI InChI=1S/C14H13N3O2/c1-19-12-3-2-6-15-13(12)14-16-10-5-4-9(8-18)7-11(10)17-14/h2-7,18H,8H2,1H3,(H,16,17)
US Patent
n/an/a 3.00E+3n/an/an/an/an/an/a
University of Virginia Patent Foundation
US Patent
Assay Description
We have developed effective assays to monitor the inhibition of CBFβ-SMMHC binding to the Runt domain (as well as for CBFβ binding to the R...
US Patent US8748618 (2014)
BindingDB Entry DOI: 10.7270/Q25M64C7