BDBM123692 US8741907, 19
SMILES: CCC(CC)n1ncc2c1nc(CC1CCCCC1)[nH]c2=S
InChI Key: InChIKey=PHBFLKWXWNOHHC-UHFFFAOYSA-N
Data: 1 IC50
Activity Spreadsheet -- Enzyme Inhibition Constant Data from BindingDB
Found 1 hit for monomerid = 123692
Trg + Lig
Ki
nM
ΔG°
kcal/mole
IC50
nM
Kd
nM
EC50/IC50
nM
koff
s-1
kon
M-1s-1
pHTemp
°C
Phosphodiesterase 9A
(Homo sapiens (Human))
BDBM123692
(US8741907, 19)
Show SMILES CCC(CC)n1ncc2c1nc(CC1CCCCC1)[nH]c2=S
Show InChI InChI=1S/C17H26N4S/c1-3-13(4-2)21-16-14(11-18-21)17(22)20-15(19-16)10-12-8-6-5-7-9-12/h11-13H,3-10H2,1-2H3,(H,19,20,22)
US Patent
n/an/a 390n/an/an/an/a7.5n/a
Boehringer Ingelheim International GmbH
US Patent
Assay Description
The test substances are dissolved in 100% DMSO and serially diluted to determine their in vitro effect on PDE 9A. 2 uL portions of the diluted substa...
US Patent US8741907 (2014)
BindingDB Entry DOI: 10.7270/Q21V5CNH