BDBM12386 1-[5-(5-Chlorothiophen-2-yl)isoxazol-3-ylmethyl]-6-methyl-1H-indole-2-carboxylic Acid (1-Isopropylpiperidin-4-yl)amide::1-{[5-(5-chlorothiophen-2-yl)-1,2-oxazol-3-yl]methyl}-6-methyl-N-[1-(propan-2-yl)piperidin-4-yl]-1H-indole-2-carboxamide::2-Carboxyindole Scaffold 13
SMILES: CC(C)N1CCC(CC1)NC(=O)c1cc2ccc(C)cc2n1Cc1cc(on1)-c1ccc(Cl)s1
InChI Key: InChIKey=ZZYWHGSUCVAUHI-UHFFFAOYSA-N
Data: 1 KI
PDB links: 2 PDB IDs contain inhibitors having a similarity of 90% to this monomer.
Activity Spreadsheet -- Enzyme Inhibition Constant Data from BindingDB
Found 1 hit for monomerid = 12386
Trg + Lig
Ki
nM
ΔG°
kcal/mole
IC50
nM
Kd
nM
EC50/IC50
nM
koff
s-1
kon
M-1s-1
pHTemp
°C
Coagulation factor X
(Homo sapiens (Human))
BDBM12386
(1-[5-(5-Chlorothiophen-2-yl)isoxazol-3-ylmethyl]-6...)
Show SMILES CC(C)N1CCC(CC1)NC(=O)c1cc2ccc(C)cc2n1Cc1cc(on1)-c1ccc(Cl)s1
Show InChI InChI=1S/C26H29ClN4O2S/c1-16(2)30-10-8-19(9-11-30)28-26(32)22-13-18-5-4-17(3)12-21(18)31(22)15-20-14-23(33-29-20)24-6-7-25(27)34-24/h4-7,12-14,16,19H,8-11,15H2,1-3H3,(H,28,32)
Reactome pathway
18 -10.6n/an/an/an/an/a7.825
Aventis Pharma
Assay Description
The inhibitory effect of test compound for human fXa was determined by using the chromogenic substrates S-2765. The hydrolysis rates of chromogenic s...
J Med Chem 48: 4511-25 (2005)
Article DOI: 10.1021/jm0490540
BindingDB Entry DOI: 10.7270/Q21834RB