BDBM12398 1-(3-Methoxy-benzyl)-1H-indole-2-carboxylic acid (1-isopropyl-piperidin-4-yl)-amide::1-[(3-methoxyphenyl)methyl]-N-[1-(propan-2-yl)piperidin-4-yl]-1H-indole-2-carboxamide::2-Carboxyindole Scaffold 43::2-carboxyindole 12
SMILES: COc1cccc(Cn2c(cc3ccccc23)C(=O)NC2CCN(CC2)C(C)C)c1
InChI Key: InChIKey=GIPCBGDQVGKMPO-UHFFFAOYSA-N
Data: 2 KI
PDB links: 1 PDB ID matches this monomer.
Activity Spreadsheet -- Enzyme Inhibition Constant Data from BindingDB
Found 2 hits for monomerid = 12398
Trg + Lig
Ki
nM
ΔG°
kcal/mole
IC50
nM
Kd
nM
EC50/IC50
nM
koff
s-1
kon
M-1s-1
pHTemp
°C
Coagulation factor X
(Homo sapiens (Human))
BDBM12398
(1-(3-Methoxy-benzyl)-1H-indole-2-carboxylic acid (...)
Show SMILES COc1cccc(Cn2c(cc3ccccc23)C(=O)NC2CCN(CC2)C(C)C)c1
Show InChI InChI=1S/C25H31N3O2/c1-18(2)27-13-11-21(12-14-27)26-25(29)24-16-20-8-4-5-10-23(20)28(24)17-19-7-6-9-22(15-19)30-3/h4-10,15-16,18,21H,11-14,17H2,1-3H3,(H,26,29)
Reactome pathway
89 -9.61n/an/an/an/an/a7.825
Aventis Pharma Deutschland GmbH
Assay Description
The inhibitory effect of test compound for human fXa was determined by using the chromogenic substrates S-2765. The hydrolysis rates of chromogenic s...
Bioorg Med Chem Lett 14: 4191-5 (2004)
Article DOI: 10.1016/j.bmcl.2004.06.020
BindingDB Entry DOI: 10.7270/Q22805WQ
3D
3D Structure (crystal)
Coagulation factor X
(Homo sapiens (Human))
BDBM12398
(1-(3-Methoxy-benzyl)-1H-indole-2-carboxylic acid (...)
Show SMILES COc1cccc(Cn2c(cc3ccccc23)C(=O)NC2CCN(CC2)C(C)C)c1
Show InChI InChI=1S/C25H31N3O2/c1-18(2)27-13-11-21(12-14-27)26-25(29)24-16-20-8-4-5-10-23(20)28(24)17-19-7-6-9-22(15-19)30-3/h4-10,15-16,18,21H,11-14,17H2,1-3H3,(H,26,29)
Reactome pathway
89n/an/an/an/an/an/an/an/a
Aventis Pharma
Assay Description
The inhibitory effect of test compound for human fXa was determined by using the chromogenic substrates S-2765. The hydrolysis rates of chromogenic s...
J Med Chem 48: 4511-25 (2005)
Article DOI: 10.1021/jm0490540
BindingDB Entry DOI: 10.7270/Q21834RB
3D
3D Structure (crystal)