null
SMILES: COc1cc2sc(nc2cc1F)-c1c(N)n[nH]c1NCCc1cnc[nH]1
InChI Key: InChIKey=RAYNDGCIBNIDFC-UHFFFAOYSA-N
Activity Spreadsheet -- Enzyme Inhibition Constant Data from BindingDB
Found 1 hit for monomerid = 123998
Trg + Lig
Ki
nM
ΔG°
kcal/mole
IC50
nM
Kd
nM
EC50/IC50
nM
koff
s-1
kon
M-1s-1
pHTemp
°C
Integrin-linked protein kinase
(Homo sapiens (Human))
BDBM123998
(US8754233, 4-(5-Fluoro-6-methoxy-benzothiazol-2-yl...)
Show SMILES COc1cc2sc(nc2cc1F)-c1c(N)n[nH]c1NCCc1cnc[nH]1
Show InChI InChI=1S/C16H16FN7OS/c1-25-11-5-12-10(4-9(11)17)22-16(26-12)13-14(18)23-24-15(13)20-3-2-8-6-19-7-21-8/h4-7H,2-3H2,1H3,(H,19,21)(H4,18,20,23,24)
Reactome pathway
US Patent
n/an/a 200n/an/an/an/an/a40
Dermira (Canada), Inc.
US Patent
Assay Description
5 uL of each compound dilution were robotically pipetted to Costar serocluster plates maintaining the same plate layout. All assay mixtures consisted...
US Patent US8754233 (2014)
BindingDB Entry DOI: 10.7270/Q23N2231