BDBM12412 CHEMBL203507::N-[5-({6-methoxy-7-[3-(morpholin-4-yl)propoxy]quinazolin-4-yl}amino)pyrimidin-2-yl]pyridine-4-carboxamide::quinazoline deriv. 10
SMILES: COc1cc2c(Nc3cnc(NC(=O)c4ccncc4)nc3)ncnc2cc1OCCCN1CCOCC1
InChI Key: InChIKey=SQNAFOVAPUKUKT-UHFFFAOYSA-N
Data: 2 IC50
Activity Spreadsheet -- Enzyme Inhibition Constant Data from BindingDB
Found 2 hits for monomerid = 12412
Trg + Lig
Ki
nM
ΔG°
kcal/mole
IC50
nM
Kd
nM
EC50/IC50
nM
koff
s-1
kon
M-1s-1
pHTemp
°C
Aurora kinase A
(Homo sapiens (Human))
BDBM12412
(CHEMBL203507 | N-[5-({6-methoxy-7-[3-(morpholin-4-...)
Show SMILES COc1cc2c(Nc3cnc(NC(=O)c4ccncc4)nc3)ncnc2cc1OCCCN1CCOCC1
Show InChI InChI=1S/C26H28N8O4/c1-36-22-13-20-21(14-23(22)38-10-2-7-34-8-11-37-12-9-34)30-17-31-24(20)32-19-15-28-26(29-16-19)33-25(35)18-3-5-27-6-4-18/h3-6,13-17H,2,7-12H2,1H3,(H,30,31,32)(H,28,29,33,35)
NCI pathway
Reactome pathway
n/an/a 690n/an/an/an/an/an/a
AstraZeneca R&D Boston
Curated by ChEMBL
Assay Description
Inhibition of Aurora A
J Med Chem 49: 4805-8 (2006)
Article DOI: 10.1021/jm060522a
BindingDB Entry DOI: 10.7270/Q2QZ29KW
Aurora kinase A
(Homo sapiens (Human))
BDBM12412
(CHEMBL203507 | N-[5-({6-methoxy-7-[3-(morpholin-4-...)
Show SMILES COc1cc2c(Nc3cnc(NC(=O)c4ccncc4)nc3)ncnc2cc1OCCCN1CCOCC1
Show InChI InChI=1S/C26H28N8O4/c1-36-22-13-20-21(14-23(22)38-10-2-7-34-8-11-37-12-9-34)30-17-31-24(20)32-19-15-28-26(29-16-19)33-25(35)18-3-5-27-6-4-18/h3-6,13-17H,2,7-12H2,1H3,(H,30,31,32)(H,28,29,33,35)
NCI pathway
Reactome pathway
n/an/a 690n/an/an/an/a7.522
AstraZeneca
Assay Description
In vitro kinase assay using recombinant Aurora A purified from Sf9 cells, was incubated at room temperature with substrate, and test compounds in the...
Bioorg Med Chem Lett 16: 1320-23 (2006)
Article DOI: 10.1016/j.bmcl.2005.11.053
BindingDB Entry DOI: 10.7270/Q2WH2N7M