null
SMILES: Cc1c(nc2cc(F)ccc2c1N1CC(C)(C)c2ncc(cc12)-c1ccnc(N)n1)-c1ccccc1S(C)(=O)=O
InChI Key: InChIKey=BJISHDDMIMFVHM-UHFFFAOYSA-N
Activity Spreadsheet -- Enzyme Inhibition Constant Data from BindingDB
Found 1 hit for monomerid = 124676
Trg + Lig
Ki
nM
ΔG°
kcal/mole
IC50
nM
Kd
nM
EC50/IC50
nM
koff
s-1
kon
M-1s-1
pHTemp
°C
Phosphatidylinositol 4,5-bisphosphate 3-kinase catalytic subunit alpha isoform
(Homo sapiens (Human))
BDBM124676
(US8765940, 4-(1-(7-fluoro-3-methyl-2-(2-(methylsul...)
Show SMILES Cc1c(nc2cc(F)ccc2c1N1CC(C)(C)c2ncc(cc12)-c1ccnc(N)n1)-c1ccccc1S(C)(=O)=O
Show InChI InChI=1S/C30H27FN6O2S/c1-17-26(21-7-5-6-8-25(21)40(4,38)39)35-23-14-19(31)9-10-20(23)27(17)37-16-30(2,3)28-24(37)13-18(15-34-28)22-11-12-33-29(32)36-22/h5-15H,16H2,1-4H3,(H2,32,33,36)
NCI pathway
Reactome pathway
US Patent
2.44n/an/an/an/an/an/a7.0n/a
Amgen Inc.
US Patent
Assay Description
A PI3K Alphascreen assay (PerkinElmer, Waltham, Mass.) was used to measure the activity of a panel of four phosphoinositide 3-kinases: PI3Kα, PI...
US Patent US8765940 (2014)
BindingDB Entry DOI: 10.7270/Q2WW7G94