null
SMILES: Cc1ccc(F)c2c(N3CC(C)(C)c4ncc(cc34)N3CCOCC3)c(C)c(nc12)-c1ccccn1
InChI Key: InChIKey=NLWKBKQCMYVXEQ-UHFFFAOYSA-N
Activity Spreadsheet -- Enzyme Inhibition Constant Data from BindingDB
Found 1 hit for monomerid = 124688
Trg + Lig
Ki
nM
ΔG°
kcal/mole
IC50
nM
Kd
nM
EC50/IC50
nM
koff
s-1
kon
M-1s-1
pHTemp
°C
Phosphatidylinositol 4,5-bisphosphate 3-kinase catalytic subunit alpha isoform
(Homo sapiens (Human))
BDBM124688
(US8765940, 4-(3,3-dimethyl-6-(4-morpholinyl)-2,3-d...)
Show SMILES Cc1ccc(F)c2c(N3CC(C)(C)c4ncc(cc34)N3CCOCC3)c(C)c(nc12)-c1ccccn1
Show InChI InChI=1S/C29H30FN5O/c1-18-8-9-21(30)24-25(18)33-26(22-7-5-6-10-31-22)19(2)27(24)35-17-29(3,4)28-23(35)15-20(16-32-28)34-11-13-36-14-12-34/h5-10,15-16H,11-14,17H2,1-4H3
NCI pathway
Reactome pathway
US Patent
4.07n/an/an/an/an/an/a7.0n/a
Amgen Inc.
US Patent
Assay Description
A PI3K Alphascreen assay (PerkinElmer, Waltham, Mass.) was used to measure the activity of a panel of four phosphoinositide 3-kinases: PI3Kα, PI...
US Patent US8765940 (2014)
BindingDB Entry DOI: 10.7270/Q2WW7G94