null
SMILES: Cc1c(nc2cc(F)cc(F)c2c1N1CC(C)(C)c2ncc(cc12)N1CCOCC1)-c1cncc(F)c1
InChI Key: InChIKey=SZVNWKDZFZRHOW-UHFFFAOYSA-N
Activity Spreadsheet -- Enzyme Inhibition Constant Data from BindingDB
Found 1 hit for monomerid = 124746
Trg + Lig
Ki
nM
ΔG°
kcal/mole
IC50
nM
Kd
nM
EC50/IC50
nM
koff
s-1
kon
M-1s-1
pHTemp
°C
Phosphatidylinositol 4,5-bisphosphate 3-kinase catalytic subunit alpha isoform
(Homo sapiens (Human))
BDBM124746
(US8765940, 4-(3,3-dimethyl-6-(4-morpholinyl)-2,3-d...)
Show SMILES Cc1c(nc2cc(F)cc(F)c2c1N1CC(C)(C)c2ncc(cc12)N1CCOCC1)-c1cncc(F)c1
Show InChI InChI=1S/C28H26F3N5O/c1-16-25(17-8-19(30)13-32-12-17)34-22-10-18(29)9-21(31)24(22)26(16)36-15-28(2,3)27-23(36)11-20(14-33-27)35-4-6-37-7-5-35/h8-14H,4-7,15H2,1-3H3
NCI pathway
Reactome pathway
US Patent
5.21n/an/an/an/an/an/a7.0n/a
Amgen Inc.
US Patent
Assay Description
A PI3K Alphascreen assay (PerkinElmer, Waltham, Mass.) was used to measure the activity of a panel of four phosphoinositide 3-kinases: PI3Kα, PI...
US Patent US8765940 (2014)
BindingDB Entry DOI: 10.7270/Q2WW7G94