BDBM12480 (2S)-({N-[(3S)-3-({[(7R,9S,12S)-12-tert-butyl-11,14-dioxo-2,6-dioxa-10,13-diazatricyclo[14.3.1.17,10]henicosa-1(20),16,18-trien-9-yl]carbonyl}amino)-2-oxohexanoyl]glycyl}amino)(phenyl)acetic acid N,N-dimethyl amide::(3S)-3-{[(7R,9S,12S)-12-tert-butyl-11,14-dioxo-2,6-dioxa-10,13-diazatricyclo[14.3.1.1^{7,10}]henicosa-1(20),16,18-trien-9-yl]formamido}-N-({[(S)-(dimethylcarbamoyl)(phenyl)methyl]carbamoyl}methyl)-2-oxohexanamide::Proline-Based Macrocycle 30
SMILES: CCC[C@H](NC(=O)[C@@H]1C[C@@H]2CN1C(=O)[C@@H](NC(=O)Cc1cccc(OCCCO2)c1)C(C)(C)C)C(=O)C(=O)NCC(=O)N[C@H](C(=O)N(C)C)c1ccccc1
InChI Key: InChIKey=UXAWVPCYEOPWKA-HTYVJUCXSA-N
Data: 1 KI
Activity Spreadsheet -- Enzyme Inhibition Constant Data from BindingDB
Found 1 hit for monomerid = 12480
Trg + Lig
Ki
nM
ΔG°
kcal/mole
IC50
nM
Kd
nM
EC50/IC50
nM
koff
s-1
kon
M-1s-1
pHTemp
°C
HCV NS3-NS4A Serine Proteinase
(Hepatitis C virus (HCV genotype 1a, isolate H))
BDBM12480
((2S)-({N-[(3S)-3-({[(7R,9S,12S)-12-tert-butyl-11,1...)
Show SMILES CCC[C@H](NC(=O)[C@@H]1C[C@@H]2CN1C(=O)[C@@H](NC(=O)Cc1cccc(OCCCO2)c1)C(C)(C)C)C(=O)C(=O)NCC(=O)N[C@H](C(=O)N(C)C)c1ccccc1 |r|
Show InChI InChI=1S/C40H54N6O9/c1-7-13-29(34(49)37(51)41-23-32(48)43-33(38(52)45(5)6)26-15-9-8-10-16-26)42-36(50)30-22-28-24-46(30)39(53)35(40(2,3)4)44-31(47)21-25-14-11-17-27(20-25)54-18-12-19-55-28/h8-11,14-17,20,28-30,33,35H,7,12-13,18-19,21-24H2,1-6H3,(H,41,51)(H,42,50)(H,43,48)(H,44,47)/t28-,29+,30+,33+,35-/m1/s1
15 -10.8n/an/an/an/an/a6.530
Schering-Plough Research Institute
Assay Description
Proteolytic cleavage of the ester linkage between the Nva (L-norvaline) and the chromophore (PAP) was monitored for change in absorbance at 370 nm. I...
J Med Chem 49: 995-1005 (2006)
Article DOI: 10.1021/jm050820s
BindingDB Entry DOI: 10.7270/Q2H70D13