BDBM124873 US8759365, 9-6
SMILES: CC[C@@H]1C[C@@H](CN1C(=O)OCC1(CC)COC1)N(Cc1cc(cc(c1)C(F)(F)F)C(F)(F)F)c1ncc(cn1)-c1cnn(C)c1
InChI Key: InChIKey=XCZDRSBSWKMKLT-RPBOFIJWSA-N
Data: 1 IC50
Activity Spreadsheet -- Enzyme Inhibition Constant Data from BindingDB
Found 1 hit for monomerid = 124873
Trg + Lig
Ki
nM
ΔG°
kcal/mole
IC50
nM
Kd
nM
EC50/IC50
nM
koff
s-1
kon
M-1s-1
pHTemp
°C
Cholesteryl ester transfer protein
(Homo sapiens (Human))
BDBM124873
(US8759365, 9-6)
Show SMILES CC[C@@H]1C[C@@H](CN1C(=O)OCC1(CC)COC1)N(Cc1cc(cc(c1)C(F)(F)F)C(F)(F)F)c1ncc(cn1)-c1cnn(C)c1 |r|
Show InChI InChI=1S/C30H34F6N6O3/c1-4-24-9-25(15-42(24)27(43)45-18-28(5-2)16-44-17-28)41(26-37-10-20(11-38-26)21-12-39-40(3)14-21)13-19-6-22(29(31,32)33)8-23(7-19)30(34,35)36/h6-8,10-12,14,24-25H,4-5,9,13,15-18H2,1-3H3/t24-,25+/m1/s1
Reactome pathway
US Patent
n/an/a 70n/an/an/an/a7.437
Novartis AG
US Patent
Assay Description
CETP Activity Kit (#RB-RPAK) was purchased from Roar Biochemical, Inc. (New York, N.Y., USA). To each well of a 96-well NBS half-area plate (costar #...
US Patent US8759365 (2014)
BindingDB Entry DOI: 10.7270/Q2NG4P95