BDBM124878 US8759365, 23-10
SMILES: CC[C@@H]1C[C@@H](CN1c1nc(ncc1Cl)N1CCC(O)CC1)N(Cc1cc(cc(c1)C(F)(F)F)C(F)(F)F)c1ncc(cn1)-c1cnn(C)c1
InChI Key: InChIKey=AGNMYLFHDJBOED-RPBOFIJWSA-N
Data: 1 IC50
Activity Spreadsheet -- Enzyme Inhibition Constant Data from BindingDB
Found 1 hit for monomerid = 124878
Trg + Lig
Ki
nM
ΔG°
kcal/mole
IC50
nM
Kd
nM
EC50/IC50
nM
koff
s-1
kon
M-1s-1
pHTemp
°C
Cholesteryl ester transfer protein
(Homo sapiens (Human))
BDBM124878
(US8759365, 23-10)
Show SMILES CC[C@@H]1C[C@@H](CN1c1nc(ncc1Cl)N1CCC(O)CC1)N(Cc1cc(cc(c1)C(F)(F)F)C(F)(F)F)c1ncc(cn1)-c1cnn(C)c1 |r|
Show InChI InChI=1S/C32H34ClF6N9O/c1-3-24-11-25(18-47(24)28-27(33)15-42-30(44-28)46-6-4-26(49)5-7-46)48(29-40-12-20(13-41-29)21-14-43-45(2)17-21)16-19-8-22(31(34,35)36)10-23(9-19)32(37,38)39/h8-10,12-15,17,24-26,49H,3-7,11,16,18H2,1-2H3/t24-,25+/m1/s1
Reactome pathway
US Patent
n/an/a 30n/an/an/an/a7.437
Novartis AG
US Patent
Assay Description
CETP Activity Kit (#RB-RPAK) was purchased from Roar Biochemical, Inc. (New York, N.Y., USA). To each well of a 96-well NBS half-area plate (costar #...
US Patent US8759365 (2014)
BindingDB Entry DOI: 10.7270/Q2NG4P95