BDBM125438 US8772480, 293
SMILES: C[C@@H](N1CCN(C[C@@H]1C)S(C)(=O)=O)c1cnc(Nc2ccc3scnc3c2)c(c1)-c1nc(C)nc(N)n1
InChI Key: InChIKey=SLFGSBCJSPHJCE-LSDHHAIUSA-N
Data: 1 KI  1 IC50
Activity Spreadsheet -- Enzyme Inhibition Constant Data from BindingDB
Found 2 hits for monomerid = 125438
Trg + Lig
Ki
nM
ΔG°
kcal/mole
IC50
nM
Kd
nM
EC50/IC50
nM
koff
s-1
kon
M-1s-1
pHTemp
°C
Phosphatidylinositol 4,5-bisphosphate 3-kinase catalytic subunit alpha isoform
(Homo sapiens (Human))
BDBM125438
(US8772480, 293)
Show SMILES C[C@@H](N1CCN(C[C@@H]1C)S(C)(=O)=O)c1cnc(Nc2ccc3scnc3c2)c(c1)-c1nc(C)nc(N)n1 |r|
Show InChI InChI=1S/C24H29N9O2S2/c1-14-12-32(37(4,34)35)7-8-33(14)15(2)17-9-19(23-28-16(3)29-24(25)31-23)22(26-11-17)30-18-5-6-21-20(10-18)27-13-36-21/h5-6,9-11,13-15H,7-8,12H2,1-4H3,(H,26,30)(H2,25,28,29,31)/t14-,15+/m0/s1
NCI pathway
Reactome pathway
US Patent
4n/an/an/an/an/an/an/an/a
Amgen Inc.
US Patent
Assay Description
The PI3K AlphaScreen assay (PerkinElmer, Waltham, Mass.) measures the activity of a panel of four phosphoinositide 3-kinases: PI3Kalpha, PI3Kbeta, PI...
US Patent US8772480 (2014)
BindingDB Entry DOI: 10.7270/Q2V123FJ
Serine/threonine-protein kinase mTOR
(Homo sapiens (Human))
BDBM125438
(US8772480, 293)
Show SMILES C[C@@H](N1CCN(C[C@@H]1C)S(C)(=O)=O)c1cnc(Nc2ccc3scnc3c2)c(c1)-c1nc(C)nc(N)n1 |r|
Show InChI InChI=1S/C24H29N9O2S2/c1-14-12-32(37(4,34)35)7-8-33(14)15(2)17-9-19(23-28-16(3)29-24(25)31-23)22(26-11-17)30-18-5-6-21-20(10-18)27-13-36-21/h5-6,9-11,13-15H,7-8,12H2,1-4H3,(H,26,30)(H2,25,28,29,31)/t14-,15+/m0/s1
NCI pathway
Reactome pathway
US Patent
n/an/a 252n/an/an/an/an/an/a
Amgen Inc.
US Patent
Assay Description
The Invitrogen (Carlsbad, Calif.) mammalian target of rapamycin (mTOR) Lanthascreen assay can be used to quantitate mTOR kinase activity in an in vit...
US Patent US8772480 (2014)
BindingDB Entry DOI: 10.7270/Q2V123FJ