null
SMILES: CCCc1[nH]c(=O)c(Cc2ccc3oc4ccccc4c3c2)c2cc(OC)c(OC)cc12
InChI Key: InChIKey=YPZCTRLKNWAEEI-UHFFFAOYSA-N
Activity Spreadsheet -- Enzyme Inhibition Constant Data from BindingDB
Found 1 hit for monomerid = 125524
Trg + Lig
Ki
nM
ΔG°
kcal/mole
IC50
nM
Kd
nM
EC50/IC50
nM
koff
s-1
kon
M-1s-1
pHTemp
°C
cAMP and cAMP-inhibited cGMP 3',5'-cyclic phosphodiesterase 10A
(Homo sapiens (Human))
BDBM125524
(US8772316, 7)
Show SMILES CCCc1[nH]c(=O)c(Cc2ccc3oc4ccccc4c3c2)c2cc(OC)c(OC)cc12
Show InChI InChI=1S/C27H25NO4/c1-4-7-22-19-15-26(31-3)25(30-2)14-18(19)21(27(29)28-22)13-16-10-11-24-20(12-16)17-8-5-6-9-23(17)32-24/h5-6,8-12,14-15H,4,7,13H2,1-3H3,(H,28,29)
Reactome pathway
US Patent
n/an/a 0.5n/an/an/an/a7.4n/a
Allergan, Inc.; Exonhit Therapeutics SA
US Patent
Assay Description
The PDE assay is based on the homogenous time-resolved fluorescence resonance energy transfer (TR-FRET) technology (LANCE from Perkin Elmer). This co...
US Patent US8772316 (2014)
BindingDB Entry DOI: 10.7270/Q2Q81BR8