null
SMILES: CCc1[nH]c(=O)c(Cc2cc3cc(OC)ccc3nc2NCCNC(C)=O)c2cc(OC)c(OC)cc12
InChI Key: InChIKey=ZBCJQWUIOZRMTM-UHFFFAOYSA-N
Activity Spreadsheet -- Enzyme Inhibition Constant Data from BindingDB
Found 1 hit for monomerid = 125586
Trg + Lig
Ki
nM
ΔG°
kcal/mole
IC50
nM
Kd
nM
EC50/IC50
nM
koff
s-1
kon
M-1s-1
pHTemp
°C
cAMP and cAMP-inhibited cGMP 3',5'-cyclic phosphodiesterase 10A
(Homo sapiens (Human))
BDBM125586
(US8772316, 69)
Show SMILES CCc1[nH]c(=O)c(Cc2cc3cc(OC)ccc3nc2NCCNC(C)=O)c2cc(OC)c(OC)cc12
Show InChI InChI=1S/C28H32N4O5/c1-6-23-21-15-26(37-5)25(36-4)14-20(21)22(28(34)32-23)13-18-11-17-12-19(35-3)7-8-24(17)31-27(18)30-10-9-29-16(2)33/h7-8,11-12,14-15H,6,9-10,13H2,1-5H3,(H,29,33)(H,30,31)(H,32,34)
Reactome pathway
US Patent
n/an/a 1.5n/an/an/an/a7.4n/a
Allergan, Inc.; Exonhit Therapeutics SA
US Patent
Assay Description
The PDE assay is based on the homogenous time-resolved fluorescence resonance energy transfer (TR-FRET) technology (LANCE from Perkin Elmer). This co...
US Patent US8772316 (2014)
BindingDB Entry DOI: 10.7270/Q2Q81BR8