null
SMILES: CCc1[nH]c(=O)c(Cc2cnc3ccc(OC)cc3c2)c2cc(OC)c(OC)cc12
InChI Key: InChIKey=XDHNENJCFGTPQR-UHFFFAOYSA-N
Activity Spreadsheet -- Enzyme Inhibition Constant Data from BindingDB
Found 1 hit for monomerid = 125602
Trg + Lig
Ki
nM
ΔG°
kcal/mole
IC50
nM
Kd
nM
EC50/IC50
nM
koff
s-1
kon
M-1s-1
pHTemp
°C
cAMP and cAMP-inhibited cGMP 3',5'-cyclic phosphodiesterase 10A
(Homo sapiens (Human))
BDBM125602
(US8772316, 85)
Show SMILES CCc1[nH]c(=O)c(Cc2cnc3ccc(OC)cc3c2)c2cc(OC)c(OC)cc12
Show InChI InChI=1S/C24H24N2O4/c1-5-20-18-12-23(30-4)22(29-3)11-17(18)19(24(27)26-20)9-14-8-15-10-16(28-2)6-7-21(15)25-13-14/h6-8,10-13H,5,9H2,1-4H3,(H,26,27)
Reactome pathway
US Patent
n/an/a 0.400n/an/an/an/a7.4n/a
Allergan, Inc.; Exonhit Therapeutics SA
US Patent
Assay Description
The PDE assay is based on the homogenous time-resolved fluorescence resonance energy transfer (TR-FRET) technology (LANCE from Perkin Elmer). This co...
US Patent US8772316 (2014)
BindingDB Entry DOI: 10.7270/Q2Q81BR8