null
SMILES: Clc1cnc2Nc3cccc(COc4cccc(CNc1n2)c4)c3
InChI Key: InChIKey=PKOKZOVQUJMMJL-UHFFFAOYSA-N
Activity Spreadsheet -- Enzyme Inhibition Constant Data from BindingDB
Found 5 hits for monomerid = 125898
Trg + Lig
Ki
nM
ΔG°
kcal/mole
IC50
nM
Kd
nM
EC50/IC50
nM
koff
s-1
kon
M-1s-1
pHTemp
°C
ALK tyrosine kinase receptor
(Homo sapiens (Human))
BDBM125898
(US8765727, 1)
Show SMILES Clc1cnc2Nc3cccc(COc4cccc(CNc1n2)c4)c3
Show InChI InChI=1S/C18H15ClN4O/c19-16-10-21-18-22-14-5-1-4-13(7-14)11-24-15-6-2-3-12(8-15)9-20-17(16)23-18/h1-8,10H,9,11H2,(H2,20,21,22,23)
US Patent
n/an/a>1.00E+3n/an/an/an/a7.8n/a
Incyte Corporation
US Patent
Assay Description
HTRF kinase assay: 40 μL reactions were run in black 384 well polystyrene plates in assay buffer (50 mM Tris, pH 7.8, 100 mM NaCI, 0.1 mg/mL BSA...
US Patent US8765727 (2014)
BindingDB Entry DOI: 10.7270/Q2FQ9V87
Tyrosine-protein kinase JAK1
(Homo sapiens (Human))
BDBM125898
(US8765727, 1)
Show SMILES Clc1cnc2Nc3cccc(COc4cccc(CNc1n2)c4)c3
Show InChI InChI=1S/C18H15ClN4O/c19-16-10-21-18-22-14-5-1-4-13(7-14)11-24-15-6-2-3-12(8-15)9-20-17(16)23-18/h1-8,10H,9,11H2,(H2,20,21,22,23)
Reactome pathway
US Patent
n/an/a 51n/an/an/an/a7.825
Incyte Corporation
US Patent
Assay Description
One or more compounds herein were tested for inhibitory activity of JAK targets according to the following in vitro assay described in Park et al., A...
US Patent US8765727 (2014)
BindingDB Entry DOI: 10.7270/Q2FQ9V87
Non-receptor tyrosine-protein kinase TYK2
(Homo sapiens (Human))
BDBM125898
(US8765727, 1)
Show SMILES Clc1cnc2Nc3cccc(COc4cccc(CNc1n2)c4)c3
Show InChI InChI=1S/C18H15ClN4O/c19-16-10-21-18-22-14-5-1-4-13(7-14)11-24-15-6-2-3-12(8-15)9-20-17(16)23-18/h1-8,10H,9,11H2,(H2,20,21,22,23)
US Patent
n/an/a 400n/an/an/an/an/an/a
Incyte Corporation
US Patent
Assay Description
TYK2 assays described by James E. Thompson et. al, Photochemical preparation of a pyridone containing tetracycle: A JAK protein kinase inhibitor, Bio...
US Patent US8765727 (2014)
BindingDB Entry DOI: 10.7270/Q2FQ9V87
Tyrosine-protein kinase JAK3
(Homo sapiens (Human))
BDBM125898
(US8765727, 1)
Show SMILES Clc1cnc2Nc3cccc(COc4cccc(CNc1n2)c4)c3
Show InChI InChI=1S/C18H15ClN4O/c19-16-10-21-18-22-14-5-1-4-13(7-14)11-24-15-6-2-3-12(8-15)9-20-17(16)23-18/h1-8,10H,9,11H2,(H2,20,21,22,23)
Reactome pathway
US Patent
n/an/a 17n/an/an/an/a7.825
Incyte Corporation
US Patent
Assay Description
One or more compounds herein were tested for inhibitory activity of JAK targets according to the following in vitro assay described in Park et al., A...
US Patent US8765727 (2014)
BindingDB Entry DOI: 10.7270/Q2FQ9V87
Tyrosine-protein kinase JAK2
(Homo sapiens (Human))
BDBM125898
(US8765727, 1)
Show SMILES Clc1cnc2Nc3cccc(COc4cccc(CNc1n2)c4)c3
Show InChI InChI=1S/C18H15ClN4O/c19-16-10-21-18-22-14-5-1-4-13(7-14)11-24-15-6-2-3-12(8-15)9-20-17(16)23-18/h1-8,10H,9,11H2,(H2,20,21,22,23)
Reactome pathway
US Patent
n/an/a 49n/an/an/an/a7.825
Incyte Corporation
US Patent
Assay Description
One or more compounds herein were tested for inhibitory activity of JAK targets according to the following in vitro assay described in Park et al., A...
US Patent US8765727 (2014)
BindingDB Entry DOI: 10.7270/Q2FQ9V87