BDBM12600 2,4-Diamino-5-ketopyrimidine 18::5-[(3-fluorophenyl)carbonyl]-2-N-[4-(4-methylpiperazin-1-yl)phenyl]pyrimidine-2,4-diamine::[4-Amino-2-[4-(4-methylpiperazin-1-yl)phenylamino]pyrimidin-5-yl](3-fluorophenyl)methanone
SMILES: CN1CCN(CC1)c1ccc(Nc2ncc(C(=O)c3cccc(F)c3)c(N)n2)cc1
InChI Key: InChIKey=OMWMSGVGDWMHKW-UHFFFAOYSA-N
Data: 3 KI
Activity Spreadsheet -- Enzyme Inhibition Constant Data from BindingDB
Found 3 hits for monomerid = 12600
Trg + Lig
Ki
nM
ΔG°
kcal/mole
IC50
nM
Kd
nM
EC50/IC50
nM
koff
s-1
kon
M-1s-1
pHTemp
°C
Cyclin-dependent kinase 4/G1/S-specific cyclin-D1
(Homo sapiens (Human))
BDBM12600
(2,4-Diamino-5-ketopyrimidine 18 | 5-[(3-fluorophen...)
Show SMILES CN1CCN(CC1)c1ccc(Nc2ncc(C(=O)c3cccc(F)c3)c(N)n2)cc1
Show InChI InChI=1S/C22H23FN6O/c1-28-9-11-29(12-10-28)18-7-5-17(6-8-18)26-22-25-14-19(21(24)27-22)20(30)15-3-2-4-16(23)13-15/h2-8,13-14H,9-12H2,1H3,(H3,24,25,26,27)
NCI pathway
Reactome pathway
450n/an/an/an/an/an/an/an/a
Hoffmann-La Roche Inc.
Assay Description
Enzymes were assayed with retinoblastoma substrate in 384-well plates containing diluted test compounds. Final ATP concentration was 3x the respectiv...
J Med Chem 49: 6549-60 (2006)
Article DOI: 10.1021/jm0606138
BindingDB Entry DOI: 10.7270/Q2QR4VB2
Cyclin-dependent kinase/G2/mitotic-specific cyclin- 1
(Homo sapiens (Human))
BDBM12600
(2,4-Diamino-5-ketopyrimidine 18 | 5-[(3-fluorophen...)
Show SMILES CN1CCN(CC1)c1ccc(Nc2ncc(C(=O)c3cccc(F)c3)c(N)n2)cc1
Show InChI InChI=1S/C22H23FN6O/c1-28-9-11-29(12-10-28)18-7-5-17(6-8-18)26-22-25-14-19(21(24)27-22)20(30)15-3-2-4-16(23)13-15/h2-8,13-14H,9-12H2,1H3,(H3,24,25,26,27)
Reactome pathway
>1.00E+4n/an/an/an/an/an/an/an/a
Hoffmann-La Roche Inc.
Assay Description
Enzymes were assayed with retinoblastoma substrate in 384-well plates containing diluted test compounds. Final ATP concentration was 3x the respectiv...
J Med Chem 49: 6549-60 (2006)
Article DOI: 10.1021/jm0606138
BindingDB Entry DOI: 10.7270/Q2QR4VB2
Cyclin-dependent kinase 2/G1/S-specific cyclin-E1
(Homo sapiens (Human))
BDBM12600
(2,4-Diamino-5-ketopyrimidine 18 | 5-[(3-fluorophen...)
Show SMILES CN1CCN(CC1)c1ccc(Nc2ncc(C(=O)c3cccc(F)c3)c(N)n2)cc1
Show InChI InChI=1S/C22H23FN6O/c1-28-9-11-29(12-10-28)18-7-5-17(6-8-18)26-22-25-14-19(21(24)27-22)20(30)15-3-2-4-16(23)13-15/h2-8,13-14H,9-12H2,1H3,(H3,24,25,26,27)
>1.00E+4>-7.09n/an/an/an/an/a7.037
Hoffmann-La Roche Inc.
Assay Description
Enzymes were assayed with retinoblastoma substrate in 384-well plates containing diluted test compounds. Final ATP concentration was 3x the respectiv...
J Med Chem 49: 6549-60 (2006)
Article DOI: 10.1021/jm0606138
BindingDB Entry DOI: 10.7270/Q2QR4VB2