BDBM12601 2,4-Diamino-5-ketopyrimidine 19::2-N-[4-(4-methylpiperazin-1-yl)phenyl]-5-{[3-(trifluoromethyl)phenyl]carbonyl}pyrimidine-2,4-diamine
SMILES: CN1CCN(CC1)c1ccc(Nc2ncc(C(=O)c3cccc(c3)C(F)(F)F)c(N)n2)cc1
InChI Key: InChIKey=JZQTULHGDHUQDF-UHFFFAOYSA-N
Data: 3 KI
Activity Spreadsheet -- Enzyme Inhibition Constant Data from BindingDB
Found 3 hits for monomerid = 12601
Trg + Lig
Ki
nM
ΔG°
kcal/mole
IC50
nM
Kd
nM
EC50/IC50
nM
koff
s-1
kon
M-1s-1
pHTemp
°C
Cyclin-dependent kinase 4/G1/S-specific cyclin-D1
(Homo sapiens (Human))
BDBM12601
(2,4-Diamino-5-ketopyrimidine 19 | 2-N-[4-(4-methyl...)
Show SMILES CN1CCN(CC1)c1ccc(Nc2ncc(C(=O)c3cccc(c3)C(F)(F)F)c(N)n2)cc1
Show InChI InChI=1S/C23H23F3N6O/c1-31-9-11-32(12-10-31)18-7-5-17(6-8-18)29-22-28-14-19(21(27)30-22)20(33)15-3-2-4-16(13-15)23(24,25)26/h2-8,13-14H,9-12H2,1H3,(H3,27,28,29,30)
NCI pathway
Reactome pathway
>1.00E+3n/an/an/an/an/an/an/an/a
Hoffmann-La Roche Inc.
Assay Description
Enzymes were assayed with retinoblastoma substrate in 384-well plates containing diluted test compounds. Final ATP concentration was 3x the respectiv...
J Med Chem 49: 6549-60 (2006)
Article DOI: 10.1021/jm0606138
BindingDB Entry DOI: 10.7270/Q2QR4VB2
Cyclin-dependent kinase/G2/mitotic-specific cyclin- 1
(Homo sapiens (Human))
BDBM12601
(2,4-Diamino-5-ketopyrimidine 19 | 2-N-[4-(4-methyl...)
Show SMILES CN1CCN(CC1)c1ccc(Nc2ncc(C(=O)c3cccc(c3)C(F)(F)F)c(N)n2)cc1
Show InChI InChI=1S/C23H23F3N6O/c1-31-9-11-32(12-10-31)18-7-5-17(6-8-18)29-22-28-14-19(21(27)30-22)20(33)15-3-2-4-16(13-15)23(24,25)26/h2-8,13-14H,9-12H2,1H3,(H3,27,28,29,30)
Reactome pathway
>1.00E+4n/an/an/an/an/an/an/an/a
Hoffmann-La Roche Inc.
Assay Description
Enzymes were assayed with retinoblastoma substrate in 384-well plates containing diluted test compounds. Final ATP concentration was 3x the respectiv...
J Med Chem 49: 6549-60 (2006)
Article DOI: 10.1021/jm0606138
BindingDB Entry DOI: 10.7270/Q2QR4VB2
Cyclin-dependent kinase 2/G1/S-specific cyclin-E1
(Homo sapiens (Human))
BDBM12601
(2,4-Diamino-5-ketopyrimidine 19 | 2-N-[4-(4-methyl...)
Show SMILES CN1CCN(CC1)c1ccc(Nc2ncc(C(=O)c3cccc(c3)C(F)(F)F)c(N)n2)cc1
Show InChI InChI=1S/C23H23F3N6O/c1-31-9-11-32(12-10-31)18-7-5-17(6-8-18)29-22-28-14-19(21(27)30-22)20(33)15-3-2-4-16(13-15)23(24,25)26/h2-8,13-14H,9-12H2,1H3,(H3,27,28,29,30)
>1.00E+4>-7.09n/an/an/an/an/a7.037
Hoffmann-La Roche Inc.
Assay Description
Enzymes were assayed with retinoblastoma substrate in 384-well plates containing diluted test compounds. Final ATP concentration was 3x the respectiv...
J Med Chem 49: 6549-60 (2006)
Article DOI: 10.1021/jm0606138
BindingDB Entry DOI: 10.7270/Q2QR4VB2