BDBM12608 2,4-Diamino-5-ketopyrimidine 26::4-[4-Amino-5-(2-methoxybenzoyl)pyrimidin-2-ylamino]piperidine-1-carboxylic Acid Ethyl Ester::ethyl 4-({4-amino-5-[(2-methoxyphenyl)carbonyl]pyrimidin-2-yl}amino)piperidine-1-carboxylate
SMILES: CCOC(=O)N1CCC(CC1)Nc1ncc(C(=O)c2ccccc2OC)c(N)n1
InChI Key: InChIKey=WRHRVUMPLKRBNL-UHFFFAOYSA-N
Data: 3 KI
Activity Spreadsheet -- Enzyme Inhibition Constant Data from BindingDB
Found 3 hits for monomerid = 12608
Trg + Lig
Ki
nM
ΔG°
kcal/mole
IC50
nM
Kd
nM
EC50/IC50
nM
koff
s-1
kon
M-1s-1
pHTemp
°C
Cyclin-dependent kinase 4/G1/S-specific cyclin-D1
(Homo sapiens (Human))
BDBM12608
(2,4-Diamino-5-ketopyrimidine 26 | 4-[4-Amino-5-(2-...)
Show SMILES CCOC(=O)N1CCC(CC1)Nc1ncc(C(=O)c2ccccc2OC)c(N)n1
Show InChI InChI=1S/C20H25N5O4/c1-3-29-20(27)25-10-8-13(9-11-25)23-19-22-12-15(18(21)24-19)17(26)14-6-4-5-7-16(14)28-2/h4-7,12-13H,3,8-11H2,1-2H3,(H3,21,22,23,24)
NCI pathway
Reactome pathway
110n/an/an/an/an/an/an/an/a
Hoffmann-La Roche Inc.
Assay Description
Enzymes were assayed with retinoblastoma substrate in 384-well plates containing diluted test compounds. Final ATP concentration was 3x the respectiv...
J Med Chem 49: 6549-60 (2006)
Article DOI: 10.1021/jm0606138
BindingDB Entry DOI: 10.7270/Q2QR4VB2
Cyclin-dependent kinase/G2/mitotic-specific cyclin- 1
(Homo sapiens (Human))
BDBM12608
(2,4-Diamino-5-ketopyrimidine 26 | 4-[4-Amino-5-(2-...)
Show SMILES CCOC(=O)N1CCC(CC1)Nc1ncc(C(=O)c2ccccc2OC)c(N)n1
Show InChI InChI=1S/C20H25N5O4/c1-3-29-20(27)25-10-8-13(9-11-25)23-19-22-12-15(18(21)24-19)17(26)14-6-4-5-7-16(14)28-2/h4-7,12-13H,3,8-11H2,1-2H3,(H3,21,22,23,24)
Reactome pathway
246n/an/an/an/an/an/an/an/a
Hoffmann-La Roche Inc.
Assay Description
Enzymes were assayed with retinoblastoma substrate in 384-well plates containing diluted test compounds. Final ATP concentration was 3x the respectiv...
J Med Chem 49: 6549-60 (2006)
Article DOI: 10.1021/jm0606138
BindingDB Entry DOI: 10.7270/Q2QR4VB2
Cyclin-dependent kinase 2/G1/S-specific cyclin-E1
(Homo sapiens (Human))
BDBM12608
(2,4-Diamino-5-ketopyrimidine 26 | 4-[4-Amino-5-(2-...)
Show SMILES CCOC(=O)N1CCC(CC1)Nc1ncc(C(=O)c2ccccc2OC)c(N)n1
Show InChI InChI=1S/C20H25N5O4/c1-3-29-20(27)25-10-8-13(9-11-25)23-19-22-12-15(18(21)24-19)17(26)14-6-4-5-7-16(14)28-2/h4-7,12-13H,3,8-11H2,1-2H3,(H3,21,22,23,24)
597 -8.83n/an/an/an/an/a7.037
Hoffmann-La Roche Inc.
Assay Description
Enzymes were assayed with retinoblastoma substrate in 384-well plates containing diluted test compounds. Final ATP concentration was 3x the respectiv...
J Med Chem 49: 6549-60 (2006)
Article DOI: 10.1021/jm0606138
BindingDB Entry DOI: 10.7270/Q2QR4VB2