BDBM126483 US8778951, 293
SMILES: COC[C@@H](C)N[C@H]1CC[C@@H](CC1)Nc1cc(c(Cl)cn1)-c1nc(NCC2CCOCC2)ccc1F
InChI Key: InChIKey=URLDOKUCRNQHLA-MISYRCLQSA-N
Data: 1 IC50
Activity Spreadsheet -- Enzyme Inhibition Constant Data from BindingDB
Found 1 hit for monomerid = 126483
Trg + Lig
Ki
nM
ΔG°
kcal/mole
IC50
nM
Kd
nM
EC50/IC50
nM
koff
s-1
kon
M-1s-1
pHTemp
°C
Cyclin-T1
(Homo sapiens (Human))
BDBM126483
(US8778951, 293)
Show SMILES COC[C@@H](C)N[C@H]1CC[C@@H](CC1)Nc1cc(c(Cl)cn1)-c1nc(NCC2CCOCC2)ccc1F |r,wU:9.12,wD:6.5,3.3,(7.56,1.68,;6.23,2.45,;4.9,1.68,;3.56,2.45,;3.56,3.99,;2.23,1.68,;.89,2.45,;.89,3.99,;-.44,4.76,;-1.77,3.99,;-1.77,2.45,;-.44,1.68,;-3.11,4.76,;-4.44,3.99,;-4.44,2.45,;-5.77,1.68,;-7.11,2.45,;-8.44,1.68,;-7.11,3.99,;-5.77,4.76,;-5.77,.14,;-4.44,-.63,;-4.44,-2.17,;-3.11,-2.94,;-1.77,-2.17,;-.44,-2.94,;-.44,-4.48,;.89,-5.25,;2.23,-4.48,;2.23,-2.94,;.89,-2.17,;-5.77,-2.94,;-7.11,-2.17,;-7.11,-.63,;-8.44,.14,)|
Show InChI InChI=1S/C26H37ClFN5O2/c1-17(16-34-2)31-19-3-5-20(6-4-19)32-25-13-21(22(27)15-30-25)26-23(28)7-8-24(33-26)29-14-18-9-11-35-12-10-18/h7-8,13,15,17-20,31H,3-6,9-12,14,16H2,1-2H3,(H,29,33)(H,30,32)/t17-,19-,20-/m1/s1
Reactome pathway
US Patent
n/an/a 0.00100n/an/an/an/an/an/a
Novartis AG
US Patent
Assay Description
Cdk9/cyclinT1 is purchased from Millipore, cat #14-685. The final total protein concentration in the assay 4 nM. The 5TAMRA-cdk7tide peptide substrat...
US Patent US8778951 (2014)
BindingDB Entry DOI: 10.7270/Q25B014T