BDBM126576 US8772283, 20
SMILES:
InChI Key: InChIKey=RMBLXWOYENNPNV-UHFFFAOYSA-N
Data: 2 IC50
Activity Spreadsheet -- Enzyme Inhibition Constant Data from BindingDB
Found 2 hits for monomerid = 126576
Trg + Lig
Ki
nM
ΔG°
kcal/mole
IC50
nM
Kd
nM
EC50/IC50
nM
koff
s-1
kon
M-1s-1
pHTemp
°C
Serine/threonine-protein kinase AKT2
(Homo sapiens (Human))
BDBM126576
(US8772283, 20)
Show InChI InChI=1S/C28H27N3O3/c1-27(32)15-28(29,16-27)20-10-8-18(9-11-20)24-25(19-6-4-3-5-7-19)31-17-34-23-13-12-21(33-2)14-22(23)26(31)30-24/h3-14,32H,15-17,29H2,1-2H3
US Patent
n/an/a 0.75n/an/an/an/a7.5n/a
Taiho Pharmaceutical Co., Ltd.
US Patent
Assay Description
Preparation of AKT1 and AKT2 and measurement of in vitro inhibitory activity of the above-mentioned compounds against AKT1 and AKT2 kinase activity w...
US Patent US8772283 (2014)
BindingDB Entry DOI: 10.7270/Q21J98F0
RAC-alpha serine/threonine-protein kinase
(Homo sapiens (Human))
BDBM126576
(US8772283, 20)
Show InChI InChI=1S/C28H27N3O3/c1-27(32)15-28(29,16-27)20-10-8-18(9-11-20)24-25(19-6-4-3-5-7-19)31-17-34-23-13-12-21(33-2)14-22(23)26(31)30-24/h3-14,32H,15-17,29H2,1-2H3
US Patent
n/an/a 2.90n/an/an/an/a7.5n/a
Taiho Pharmaceutical Co., Ltd.
US Patent
Assay Description
Preparation of AKT1 and AKT2 and measurement of in vitro inhibitory activity of the above-mentioned compounds against AKT1 and AKT2 kinase activity w...
US Patent US8772283 (2014)
BindingDB Entry DOI: 10.7270/Q21J98F0