BDBM126578 US8772283, 22
SMILES: NC1(CC(O)(C1)C1CC1)c1ccc(cc1)-c1nc2-c3c(Cl)cccc3OCn2c1-c1ccccc1
InChI Key: InChIKey=QSPSIQVFQDMHRF-UHFFFAOYSA-N
Data: 2 IC50
Activity Spreadsheet -- Enzyme Inhibition Constant Data from BindingDB
Found 2 hits for monomerid = 126578
Trg + Lig
Ki
nM
ΔG°
kcal/mole
IC50
nM
Kd
nM
EC50/IC50
nM
koff
s-1
kon
M-1s-1
pHTemp
°C
RAC-beta serine/threonine-protein kinase
(Homo sapiens (Human))
BDBM126578
(US8772283, 22)
Show SMILES NC1(CC(O)(C1)C1CC1)c1ccc(cc1)-c1nc2-c3c(Cl)cccc3OCn2c1-c1ccccc1 |(7.56,3.47,;6.23,4.24,;5.14,5.33,;6.31,6.43,;6.36,7.97,;7.32,5.33,;4.9,7.07,;3.57,6.3,;4.13,8.4,;4.89,3.47,;3.56,4.24,;2.23,3.47,;2.23,1.93,;3.56,1.16,;4.89,1.93,;.93,1.09,;-.5,1.64,;-1.47,.45,;-3.01,.45,;-3.78,1.78,;-2.69,2.87,;-5.32,1.78,;-6.09,.45,;-5.32,-.89,;-3.78,-.89,;-3.01,-2.22,;-1.47,-2.22,;-.7,-.89,;.85,-.45,;2.06,-1.41,;1.66,-2.89,;2.75,-3.98,;4.23,-3.58,;4.63,-2.1,;3.54,-1.01,)|
Show InChI InChI=1S/C29H26ClN3O2/c30-22-7-4-8-23-24(22)27-32-25(26(33(27)17-35-23)19-5-2-1-3-6-19)18-9-11-20(12-10-18)28(31)15-29(34,16-28)21-13-14-21/h1-12,21,34H,13-17,31H2
US Patent
n/an/a 0.300n/an/an/an/a7.5n/a
Taiho Pharmaceutical Co., Ltd.
US Patent
Assay Description
Preparation of AKT1 and AKT2 and measurement of in vitro inhibitory activity of the above-mentioned compounds against AKT1 and AKT2 kinase activity w...
US Patent US8772283 (2014)
BindingDB Entry DOI: 10.7270/Q21J98F0
RAC-alpha serine/threonine-protein kinase
(Homo sapiens (Human))
BDBM126578
(US8772283, 22)
Show SMILES NC1(CC(O)(C1)C1CC1)c1ccc(cc1)-c1nc2-c3c(Cl)cccc3OCn2c1-c1ccccc1 |(7.56,3.47,;6.23,4.24,;5.14,5.33,;6.31,6.43,;6.36,7.97,;7.32,5.33,;4.9,7.07,;3.57,6.3,;4.13,8.4,;4.89,3.47,;3.56,4.24,;2.23,3.47,;2.23,1.93,;3.56,1.16,;4.89,1.93,;.93,1.09,;-.5,1.64,;-1.47,.45,;-3.01,.45,;-3.78,1.78,;-2.69,2.87,;-5.32,1.78,;-6.09,.45,;-5.32,-.89,;-3.78,-.89,;-3.01,-2.22,;-1.47,-2.22,;-.7,-.89,;.85,-.45,;2.06,-1.41,;1.66,-2.89,;2.75,-3.98,;4.23,-3.58,;4.63,-2.1,;3.54,-1.01,)|
Show InChI InChI=1S/C29H26ClN3O2/c30-22-7-4-8-23-24(22)27-32-25(26(33(27)17-35-23)19-5-2-1-3-6-19)18-9-11-20(12-10-18)28(31)15-29(34,16-28)21-13-14-21/h1-12,21,34H,13-17,31H2
US Patent
n/an/a 8.20n/an/an/an/a7.5n/a
Taiho Pharmaceutical Co., Ltd.
US Patent
Assay Description
Preparation of AKT1 and AKT2 and measurement of in vitro inhibitory activity of the above-mentioned compounds against AKT1 and AKT2 kinase activity w...
US Patent US8772283 (2014)
BindingDB Entry DOI: 10.7270/Q21J98F0